{
  "functions": {
    "source": ".",
    "predeploy": "npm run lint && npm run build"
  },
  "emulators": {
    "functions": {
      "port": 5001
    },
    "database": {
      "port": 9000
    },
    "ui": {
      "enabled": true
    }
  }
}
