{
  "functions": {
    "source": ".",
    "predeploy": "npm run build-firebase"
  },
  "database": {
    "rules": "database.json"
  },
  "emulators": {
    "auth": {
      "port": 9099
    },
    "functions": {
      "port": 5001
    },
    "database": {
      "port": 9000
    },
    "ui": {
      "enabled": true
    }
  }
}
