{
  "functions": {
    "predeploy": "npm --prefix \"$RESOURCE_DIR\" run build-firebase",
    "source": "functions"
  },
  "database": {
    "rules": "database.rules.json"
  },
  "emulators": {
    "auth": {
      "port": 9099
    },
    "functions": {
      "port": 5001
    },
    "database": {
      "port": 9000
    },
    "storage": {
      "port": 9199
    },
    "ui": {
      "enabled": true
    }
  }
}
