{
  "2019S2": {
    "Channel": {
      "DIRECTLINE": [
        {
          "ojPkmw-O5KLBLpGqUXWp83VtN9Uo": {
            "Log_Message": [
              {
                "2020-01-17T06:12:28:008Z": {
                  "Activity": "{\"type\":\"message\",\"id\":\"9C68slOHOiGJRl4b51VuFD-f|0000668\",\"timestamp\":\"2020-01-17T06:12:28.008Z\",\"serviceUrl\":\"https://directline.botframework.com/\",\"channelId\":\"directline\",\"from\":{\"id\":\"ojPkmw-O5KLBLpGqUXWp83VtN9Uo\",\"name\":\"WeChat\",\"role\":\"user\"},\"conversation\":{\"id\":\"9C68slOHOiGJRl4b51VuFD-f\"},\"recipient\":{\"id\":\"WeChatyBot@ARNO6ywCnDs\",\"name\":\"WeChatyBot\"},\"text\":\"Peter\"}"
                }
              }
            ],
            "Conversation_Details": "{\"activityId\":\"1w9KKOFpOspHb3VHQiKVvL-6|0000095\",\"user\":{\"id\":\"ojPkmw-O5KLBLpGqUXWp83VtN9Uo\",\"name\":\"WeChat\",\"role\":\"user\"},\"bot\":{\"id\":\"WeChatyBot@ARNO6ywCnDs\",\"name\":\"WeChatyBot\"},\"conversation\":{\"id\":\"1w9KKOFpOspHb3VHQiKVvL-6\"},\"channelId\":\"directline\",\"serviceUrl\":\"https://directline.botframework.com/\"}",
            "Conversation_Id": "1w9KKOFpOspHb3VHQiKVvL-6",
            "Created_At": "17 January 2020 at 17:16:54 UTC+11",
            "Student_Id": "01141552"
          }
        }
      ],
      "EMULATOR": [],
      "FACEBOOK": [],
      "LINE": []
    },
    "Setting": {
      "Previous_Setting": {
        "Registration": true,
        "Upload": false,
        "Ranking": false,
        "Reallocate": false,
        "Review": false,
        "Summary": false
      },
      "Registration": true,
      "Upload": false,
      "Ranking": false,
      "Reallocate": false,
      "Review": false,
      "Summary": false
    },
    "User": {
      "AssessStatus": [
        { "01141552": { "Rank_Received_No": 1 } },
        { "29054060": { "Rank_Received_No": 0 } },
        { "30000000": { "Rank_Received_No": 2 } },
        { "30000007": { "Rank_Received_No": 1 } }
      ],
      "UserProfile": [
        {
          "01141552": {
            "Rank_Provided": [
              {
                "8tMtvfucl5Ima54AHVKK": {
                  "Audience_Rank": [
                    { "1": "300000004" },
                    { "2": "300000003" },
                    { "3": "300000002" }
                  ],
                  "Created_At": "17 January 2020 at 17:22:03 UTC+11",
                  "Visual_Rank": [
                    { "1": "300000004" },
                    { "2": "300000002" },
                    { "3": "300000003" }
                  ]
                }
              }
            ],
            "Rank_Received": [
              {
                "GFMjW60JQ5hl8tHbDPAx": {
                  "Audience_Rank": [
                    { "1": "300000007" },
                    { "2": "01141552" },
                    { "3": "300000008" }
                  ],
                  "Created_At": "17 January 2020 at 17:26:11 UTC+11",
                  "Rank_Provider": "29054060",
                  "Visual_Rank": [
                    { "1": "01141552" },
                    { "2": "300000007" },
                    { "3": "300000008" }
                  ]
                }
              },
              { "29054060": {} },
              { "30000000": {} },
              { "30000001": {} },
              { "30000002": {} },
              { "30000003": {} },
              { "30000004": {} },
              { "30000005": {} },
              { "30000006": {} },
              { "30000007": {} },
              { "30000008": {} },
              { "30000009": {} }
            ],
            "Rank_Details": [
              {
                "ukZNodKuezROGPChCHTi": {
                  "Student_Id": "30000001",
                  "Criteria": "Audience Communication",
                  "Detail_Message": "This video fails to communicate well to the target audience.",
                  "Reply_At": "17 January 2020 at 18:25:10 UTC+11",
                  "Rank_Provided": 2,
                  "Created_At": "17 January 2020 at 17:40:13 UTC+11"
                }
              }
            ],
            "Channel": "DIRECTLIN",
            "Created_At": "17 January 2020 at 17:16:54 UTC+11",
            "Index": 1,
            "Rank_Provided_No": 1,
            "Rank_Received_No": 1,
            "Reply_Flag": true,
            "Student_Name": "Peter Chen",
            "Submission_Time": "17 January 2020 at 17:17:55 UTC+11",
            "User_Id": "ojPkmw-O5KLBLpGqUXWp83VtN9Uo"
          }
        }
      ],
      "UserCount": 12
    },
    "WeChatSetting": {
      "Previous_Setting": {
        "Registration": true,
        "Upload": false,
        "Ranking": false,
        "Reallocate": false,
        "Review": false,
        "Summary": false
      },
      "Registration": true,
      "Upload": false,
      "Ranking": false,
      "Reallocate": false,
      "Review": false,
      "Summary": false
    }
  }
}
