{
  "hosting": {
    "public": "dist",
    "rewrites": [
      {
        "source": "**",
        "destination": "/index.html"
      }
    ],
    "site": "cop27-1fce1",
    "ignore": ["firebase.json", "**/.*", "**/node_modules/**"]
  }
}
