[
  {
    "code": "al",
    "flag": "🇦🇱",
    "name": "Albania: Albanian Red Cross"
  },
  {
    "code": "af",
    "flag": "🇦🇫",
    "name": "Afghanistan: Afghan Red Crescent Society"
  },
  {
    "code": "dz",
    "flag": "🇩🇿",
    "name": "Algeria: Algerian Red Crescent"
  },
  {
    "code": "ad",
    "flag": "🇦🇩",
    "name": "Andorra: Andorran Red Cross"
  },
  {
    "code": "ao",
    "flag": "🇦🇴",
    "name": "Angola: Angola Red Cross"
  },
  {
    "code": "ag",
    "flag": "🇦🇬",
    "name": "Antigua and Barbuda: Antigua and Barbuda Red Cross Society"
  },
  {
    "code": "ar",
    "flag": "🇦🇶",
    "name": "Argentina: Argentine Red Cross"
  },
  {
    "code": "am",
    "flag": "🇦🇲",
    "name": "Armenia: Armenian Red Cross Society"
  },
  {
    "code": "au",
    "flag": "🇦🇺",
    "name": "Australia: Australian Red Cross"
  },
  {
    "code": "at",
    "flag": "🇦🇹",
    "name": "Austria: Austrian Red Cross"
  },
  {
    "code": "az",
    "flag": "🇦🇿",
    "name": "Azerbaijan: Red Crescent Society of Azerbaijan"
  },
  {
    "code": "bs",
    "flag": "🇧🇸",
    "name": "Bahamas: Bahamas Red Cross"
  },
  {
    "code": "bh",
    "flag": "🇧🇭",
    "name": "Bahrain: Bahrain Red Crescent Society"
  },
  {
    "code": "bd",
    "flag": "🇧🇩",
    "name": "Bangladesh: Bangladesh Red Crescent Society"
  },
  {
    "code": "bb",
    "flag": "🇧🇧",
    "name": "Barbados: Barbados Red Cross Society"
  },
  {
    "code": "by",
    "flag": "🇧🇾",
    "name": "Belarus: Belarus Red Cross"
  },
  {
    "code": "be",
    "flag": "🇧🇪",
    "name": "Belgium: Belgian Red Cross"
  },
  {
    "code": "bz",
    "flag": "🇧🇿",
    "name": "Belize: Belize Red Cross Society"
  },
  {
    "code": "bj",
    "flag": "🇧🇯",
    "name": "Benin: Red Cross of Benin"
  },
  {
    "code": "bt",
    "flag": "🇧🇹",
    "name": "Bhutan: Bhutan Red Cross Society"
  },
  {
    "code": "bo",
    "flag": "🇧🇴",
    "name": "Bolivia: Bolivian Red Cross"
  },
  {
    "code": "ba",
    "flag": "🇧🇦",
    "name": "Bosnia and Herzegovina: Red Cross Society of Bosnia and Herzegovina"
  },
  {
    "code": "bw",
    "flag": "🇧🇼",
    "name": "Botswana: Botswana Red Cross Society"
  },
  {
    "code": "br",
    "flag": "🇧🇷",
    "name": "Brazil: Brazilian Red Cross"
  },
  {
    "code": "bn",
    "flag": "🇧🇳",
    "name": "Brunei: Brunei Darussalam Red Crescent Society"
  },
  {
    "code": "bg",
    "flag": "🇧🇬",
    "name": "Bulgaria: Bulgarian Red Cross"
  },
  {
    "code": "bf",
    "flag": "🇧🇫",
    "name": "Burkina Faso: Burkinabe Red Cross Society"
  },
  {
    "code": "bi",
    "flag": "🇧🇮",
    "name": "Burundi: Burundi Red Cross"
  },
  {
    "code": "kh",
    "flag": "🇰🇭",
    "name": "Cambodia: Cambodian Red Cross"
  },
  {
    "code": "cm",
    "flag": "🇨🇲",
    "name": "Cameroon: Cameroon Red Cross Society"
  },
  {
    "code": "ca",
    "flag": "🇨🇦",
    "name": "Canada: Canadian Red Cross"
  },
  {
    "code": "cv",
    "flag": "🇨🇻",
    "name": "Cape Verde: Red Cross of Cape Verde"
  },
  {
    "code": "cf",
    "flag": "🇨🇫",
    "name": "Central African Republic: Central African Red Cross Society"
  },
  {
    "code": "td",
    "flag": "🇹🇩",
    "name": "Chad: Red Cross of Chad"
  },
  {
    "code": "cl",
    "flag": "🇨🇱",
    "name": "Chile: Chilean Red Cross"
  },
  {
    "code": "cn",
    "flag": "🇨🇳",
    "name": "China, People's Republic of: Red Cross Society of China"
  },
  {
    "code": "hk",
    "flag": "🇭🇰",
    "name": "Hong Kong: Hong Kong Red Cross (autonomous branch of the Red Cross Society of China)"
  },
  {
    "code": "mo",
    "flag": "🇲🇴",
    "name": "Macau: Macau Red Cross (autonomous branch of the Red Cross Society of China)"
  },
  {
    "code": "co",
    "flag": "🇨🇴",
    "name": "Colombia: Colombian Red Cross"
  },
  {
    "code": "km",
    "flag": "🇰🇲",
    "name": "Comoros: The Comoros Red Crescent"
  },
  {
    "code": "cg",
    "flag": "🇨🇬",
    "name": "Republic of the Congo: Congolese Red Cross [it]"
  },
  {
    "code": "cd",
    "flag": "🇨🇩",
    "name": "Democratic Republic of the Congo: Red Cross of the Democratic Republic of the Congo"
  },
  {
    "code": "ck",
    "flag": "🇨🇰",
    "name": "Cook Islands: Cook Islands Red Cross"
  },
  {
    "code": "cr",
    "flag": "🇨🇷",
    "name": "Costa Rica: Costa Rica Red Cross"
  },
  {
    "code": "ci",
    "flag": "🇨🇮",
    "name": "Côte d'Ivoire: Red Cross Society of Côte d'Ivoire"
  },
  {
    "code": "hr",
    "flag": "🇭🇷",
    "name": "Croatia: Croatian Red Cross"
  },
  {
    "code": "cu",
    "flag": "🇨🇺",
    "name": "Cuba: Cuban Red Cross"
  },
  {
    "code": "cy",
    "flag": "🇨🇾",
    "name": "Cyprus: Cyprus Red Cross"
  },
  {
    "code": "cz",
    "flag": "🇨🇿",
    "name": "Czech Republic: Czech Red Cross"
  },
  {
    "code": "dk",
    "flag": "🇩🇰",
    "name": "Denmark: Danish Red Cross"
  },
  {
    "code": "dj",
    "flag": "🇩🇯",
    "name": "Djibouti: Red Crescent Society of Djibouti"
  },
  {
    "code": "dm",
    "flag": "🇩🇲",
    "name": "Dominica: Dominica Red Cross Society"
  },
  {
    "code": "do",
    "flag": "🇩🇴",
    "name": "Dominican Republic: Dominican Red Cross"
  },
  {
    "code": "ex",
    "flag": "🇪🇨",
    "name": "Ecuador: Ecuadorian Red Cross"
  },
  {
    "code": "eg",
    "flag": "🇪🇬",
    "name": "Egypt: Egyptian Red Crescent Society"
  },
  {
    "code": "sv",
    "flag": "🇸🇻",
    "name": "El Salvador: Salvadoran Red Cross Society"
  },
  {
    "code": "eg",
    "flag": "🇪🇬",
    "name": "Equatorial Guinea: Red Cross of Equatorial Guinea"
  },
  {
    "code": "sz",
    "flag": "🇸🇿",
    "name": "Eswatini: Baphalali Eswatini Red Cross Society"
  },
  {
    "code": "er",
    "flag": "🇪🇷",
    "name": "Eritrea: Red Cross Society of Eritrea"
  },
  {
    "code": "ee",
    "flag": "🇪🇪",
    "name": "Estonia: Estonian Red Cross"
  },
  {
    "code": "et",
    "flag": "🇪🇹",
    "name": "Ethiopia: Ethiopian Red Cross Society"
  },
  {
    "code": "fj",
    "flag": "🇫🇯",
    "name": "Fiji: Fiji Red Cross Society"
  },
  {
    "code": "fi",
    "flag": "🇫🇮",
    "name": "Finland: Finnish Red Cross"
  },
  {
    "code": "fr",
    "flag": "🇫🇷",
    "name": "France: French Red Cross"
  },
  {
    "code": "ga",
    "flag": "🇬🇦",
    "name": "Gabon: Gabonese Red Cross Society"
  },
  {
    "code": "gm",
    "flag": "🇬🇲",
    "name": "Gambia: Gambia Red Cross Society"
  },
  {
    "code": "ge",
    "flag": "🇬🇪",
    "name": "Georgia: Red Cross Society of Georgia"
  },
  {
    "code": "de",
    "flag": "🇩🇪",
    "name": "Germany: German Red Cross (Baden Red Cross and Bavaria Red Cross, are still existing as the divisions of the German Red Cross)"
  },
  {
    "code": "gh",
    "flag": "🇬🇭",
    "name": "Ghana: Ghana Red Cross Society"
  },
  {
    "code": "gr",
    "flag": "🇬🇷",
    "name": "Greece: Hellenic Red Cross"
  },
  {
    "code": "gd",
    "flag": "🇬🇩",
    "name": "Grenada: Grenada Red Cross Society"
  },
  {
    "code": "gt",
    "flag": "🇬🇹",
    "name": "Guatemala: Guatemalan Red Cross"
  },
  {
    "code": "gn",
    "flag": "🇬🇳",
    "name": "Guinea: Red Cross Society of Guinea"
  },
  {
    "code": "gw",
    "flag": "🇬🇼",
    "name": "Guinea-Bissau: Red Cross Society of Guinea-Bissau"
  },
  {
    "code": "gy",
    "flag": "🇬🇾",
    "name": "Guyana: Guyana Red Cross Society"
  },
  {
    "code": "ht",
    "flag": "🇭🇹",
    "name": "Haiti: Haiti Red Cross Society"
  },
  {
    "code": "hn",
    "flag": "🇭🇳",
    "name": "Honduras: Honduran Red Cross"
  },
  {
    "code": "hu",
    "flag": "🇭🇺",
    "name": "Hungary: Hungarian Red Cross"
  },
  {
    "code": "is",
    "flag": "🇮🇸",
    "name": "Iceland: Icelandic Red Cross"
  },
  {
    "code": "in",
    "flag": "🇮🇳",
    "name": "India: Indian Red Cross Society"
  },
  {
    "code": "id",
    "flag": "🇮🇩",
    "name": "Indonesia: Indonesian Red Cross Society"
  },
  {
    "code": "ir",
    "flag": "🇮🇷",
    "name": "Iran: Red Crescent Society of the Islamic Republic of Iran"
  },
  {
    "code": "iq",
    "flag": "🇮🇶",
    "name": "Iraq: Iraqi Red Crescent Society"
  },
  {
    "code": "ie",
    "flag": "🇮🇪",
    "name": "Ireland: Irish Red Cross Society"
  },
  {
    "code": "il",
    "flag": "🇮🇱",
    "name": "Israel: Magen David Adom in Israel"
  },
  {
    "code": "it",
    "flag": "🇮🇹",
    "name": "Italy: Italian Red Cross"
  },
  {
    "code": "jm",
    "flag": "🇯🇲",
    "name": "Jamaica: Jamaica Red Cross"
  },
  {
    "code": "jp",
    "flag": "🇯🇵",
    "name": "Japan: Japanese Red Cross Society"
  },
  {
    "code": "jo",
    "flag": "🇯🇴",
    "name": "Jordan: Jordan National Red Crescent Society"
  },
  {
    "code": "kz",
    "flag": "🇰🇿",
    "name": "Kazakhstan: Kazakh Red Crescent"
  },
  {
    "code": "ke",
    "flag": "🇰🇪",
    "name": "Kenya: Kenya Red Cross Society"
  },
  {
    "code": "ki",
    "flag": "🇰🇮",
    "name": "Kiribati: Kiribati Red Cross Society"
  },
  {
    "code": "kp",
    "flag": "🇰🇵",
    "name": "North Korea: Red Cross Society of the Democratic People's Republic of Korea"
  },
  {
    "code": "kr",
    "flag": "🇰🇷",
    "name": "South Korea: Republic of Korea National Red Cross (KRC)"
  },
  {
    "code": "kw",
    "flag": "🇰🇼",
    "name": "Kuwait: Kuwait Red Crescent Society"
  },
  {
    "code": "kg",
    "flag": "🇰🇬",
    "name": "Kyrgyzstan: Red Crescent Society of Kyrgyzstan"
  },
  {
    "code": "la",
    "flag": "🇱🇦",
    "name": "Laos: Lao Red Cross"
  },
  {
    "code": "lv",
    "flag": "🇱🇻",
    "name": "Latvia: Latvian Red Cross"
  },
  {
    "code": "lb",
    "flag": "🇱🇧",
    "name": "Lebanon: Lebanese Red Cross"
  },
  {
    "code": "ls",
    "flag": "🇱🇸",
    "name": "Lesotho: Lesotho Red Cross Society"
  },
  {
    "code": "lr",
    "flag": "🇱🇷",
    "name": "Liberia: Liberian Red Cross Society"
  },
  {
    "code": "ly",
    "flag": "🇱🇾",
    "name": "Libya: Libyan Red Crescent"
  },
  {
    "code": "li",
    "flag": "🇱🇮",
    "name": "Liechtenstein: Liechtenstein Red Cross"
  },
  {
    "code": "lt",
    "flag": "🇱🇹",
    "name": "Lithuania: Lithuanian Red Cross Society"
  },
  {
    "code": "lu",
    "flag": "🇱🇺",
    "name": "Luxembourg: Luxembourg Red Cross"
  },
  {
    "code": "mg",
    "flag": "🇲🇬",
    "name": "Madagascar: Malagasy Red Cross Society"
  },
  {
    "code": "mw",
    "flag": "🇲🇼",
    "name": "Malawi: Malawi Red Cross Society"
  },
  {
    "code": "my",
    "flag": "🇲🇾",
    "name": "Malaysia: Malaysian Red Crescent Society"
  },
  {
    "code": "mv",
    "flag": "🇲🇻",
    "name": "Maldives: Maldivian Red Crescent"
  },
  {
    "code": "ml",
    "flag": "🇲🇱",
    "name": "Mali: Mali Red Cross"
  },
  {
    "code": "mt",
    "flag": "🇲🇹",
    "name": "Malta: Malta Red Cross Society"
  },
  {
    "code": "mh",
    "flag": "🇲🇭",
    "name": "Marshall Islands: Marshall Islands Red Cross Society"
  },
  {
    "code": "mr",
    "flag": "🇲🇷",
    "name": "Mauritania: Mauritanian Red Crescent"
  },
  {
    "code": "mu",
    "flag": "🇲🇺",
    "name": "Mauritius: Mauritius Red Cross Society"
  },
  {
    "code": "mx",
    "flag": "🇲🇽",
    "name": "Mexico: Mexican Red Cross"
  },
  {
    "code": "fm",
    "flag": "🇫🇲",
    "name": "Micronesia, Federated States of: Micronesia Red Cross Society"
  },
  {
    "code": "md",
    "flag": "🇲🇩",
    "name": "Moldova: Red Cross Society of the Republic of Moldova"
  },
  {
    "code": "mc",
    "flag": "🇲🇨",
    "name": "Monaco: Red Cross of Monaco"
  },
  {
    "code": "mn",
    "flag": "🇲🇳",
    "name": "Mongolia: Mongolian Red Cross Society"
  },
  {
    "code": "me",
    "flag": "🇲🇪",
    "name": "Montenegro: Red Cross of Montenegro"
  },
  {
    "code": "ma",
    "flag": "🇲🇦",
    "name": "Morocco: Moroccan Red Crescent"
  },
  {
    "code": "mz",
    "flag": "🇲🇿",
    "name": "Mozambique: Mozambique Red Cross Society"
  },
  {
    "code": "mm",
    "flag": "🇲🇲",
    "name": "Myanmar: Myanmar Red Cross Society"
  },
  {
    "code": "na",
    "flag": "🇳🇦",
    "name": "Namibia: Namibia Red Cross Society"
  },
  {
    "code": "np",
    "flag": "🇳🇵",
    "name": "Nepal: Nepal Red Cross Society"
  },
  {
    "code": "nl",
    "flag": "🇳🇱",
    "name": "Netherlands: Netherlands Red Cross"
  },
  {
    "code": "nz",
    "flag": "🇳🇿",
    "name": "New Zealand: New Zealand Red Cross"
  },
  {
    "code": "ni",
    "flag": "🇳🇮",
    "name": "Nicaragua: Nicaraguan Red Cross"
  },
  {
    "code": "ne",
    "flag": "🇳🇪",
    "name": "Niger: Red Cross Society of Niger"
  },
  {
    "code": "ng",
    "flag": "🇳🇬",
    "name": "Nigeria: Nigerian Red Cross Society"
  },
  {
    "code": "mk",
    "flag": "🇲🇰",
    "name": "North Macedonia: Red Cross of the Republic of North Macedonia"
  },
  {
    "code": "no",
    "flag": "🇳🇴",
    "name": "Norway: Norwegian Red Cross"
  },
  {
    "code": "pk",
    "flag": "🇵🇰",
    "name": "Pakistan: Pakistan Red Crescent"
  },
  {
    "code": "pw",
    "flag": "🇵🇼",
    "name": "Palau: Palau Red Cross Society"
  },
  {
    "code": "ps",
    "flag": "🇵🇸",
    "name": "Palestine: Palestine Red Crescent Society"
  },
  {
    "code": "pa",
    "flag": "🇵🇦",
    "name": "Panama: Red Cross Society of Panama"
  },
  {
    "code": "pg",
    "flag": "🇵🇬",
    "name": "Papua New Guinea: Papua New Guinea Red Cross Society"
  },
  {
    "code": "py",
    "flag": "🇵🇾",
    "name": "Paraguay: Paraguayan Red Cross"
  },
  {
    "code": "pe",
    "flag": "🇵🇪",
    "name": "Peru: Peruvian Red Cross"
  },
  {
    "code": "ph",
    "flag": "🇵🇭",
    "name": "Philippines: Philippine Red Cross"
  },
  {
    "code": "pl",
    "flag": "🇵🇱",
    "name": "Poland: Polish Red Cross"
  },
  {
    "code": "pt",
    "flag": "🇵🇹",
    "name": "Portugal: Portuguese Red Cross"
  },
  {
    "code": "qa",
    "flag": "🇶🇦",
    "name": "Qatar: Qatar Red Crescent Society"
  },
  {
    "code": "ro",
    "flag": "🇷🇴",
    "name": "Romania: Romanian Red Cross"
  },
  {
    "code": "ru",
    "flag": "🇷🇺",
    "name": "Russia: Russian Red Cross Society"
  },
  {
    "code": "rw",
    "flag": "🇷🇼",
    "name": "Rwanda: Rwandan Red Cross"
  },
  {
    "code": "kn",
    "flag": "🇰🇳",
    "name": "Saint Kitts and Nevis: Saint Kitts and Nevis Red Cross Society"
  },
  {
    "code": "lc",
    "flag": "🇱🇨",
    "name": "Saint Lucia: Saint Lucia Red Cross"
  },
  {
    "code": "vc",
    "flag": "🇻🇨",
    "name": "Saint Vincent and the Grenadines: Saint Vincent and the Grenadines Red Cross"
  },
  {
    "code": "ws",
    "flag": "🇼🇸",
    "name": "Samoa: Samoa Red Cross Society"
  },
  {
    "code": "sm",
    "flag": "🇸🇲",
    "name": "San Marino: Red Cross of the Republic of San Marino"
  },
  {
    "code": "st",
    "flag": "🇸🇹",
    "name": "São Tomé and Príncipe: São Tomé and Príncipe Red Cross"
  },
  {
    "code": "sa",
    "flag": "🇸🇦",
    "name": "Saudi Arabia: Saudi Red Crescent Authority"
  },
  {
    "code": "sn",
    "flag": "🇸🇳",
    "name": "Senegal: Senegalese Red Cross Society"
  },
  {
    "code": "rs",
    "flag": "🇸🇷",
    "name": "Serbia: Red Cross of Serbia"
  },
  {
    "code": "sc",
    "flag": "🇸🇷",
    "name": "Seychelles: Seychelles Red Cross Society"
  },
  {
    "code": "sl",
    "flag": "🇸🇱",
    "name": "Sierra Leone: Sierra Leone Red Cross Society"
  },
  {
    "code": "sg",
    "flag": "🇸🇬",
    "name": "Singapore: Singapore Red Cross Society"
  },
  {
    "code": "sk",
    "flag": "🇸🇰",
    "name": "Slovakia: Slovak Red Cross"
  },
  {
    "code": "si",
    "flag": "🇸🇮",
    "name": "Slovenia: Slovenian Red Cross"
  },
  {
    "code": "sb",
    "flag": "🇸🇧",
    "name": "Solomon Islands: Solomon Islands Red Cross"
  },
  {
    "code": "so",
    "flag": "🇸🇴",
    "name": "Somalia: Somali Red Crescent Society"
  },
  {
    "code": "za",
    "flag": "🇿🇦",
    "name": "South Africa: South African Red Cross Society"
  },
  {
    "code": "ss",
    "flag": "🇸🇸",
    "name": "South Sudan: South Sudan Red Cross"
  },
  {
    "code": "es",
    "flag": "🇪🇸",
    "name": "Spain: Spanish Red Cross [es] (CRE)"
  },
  {
    "code": "lk",
    "flag": "🇱🇰",
    "name": "Sri Lanka: Sri Lanka Red Cross Society"
  },
  {
    "code": "sd",
    "flag": "🇸🇩",
    "name": "Sudan: Sudanese Red Crescent"
  },
  {
    "code": "sr",
    "flag": "🇸🇷",
    "name": "Suriname: Suriname Red Cross"
  },
  {
    "code": "se",
    "flag": "🇸🇪",
    "name": "Sweden: Swedish Red Cross"
  },
  {
    "code": "ch",
    "flag": "🇨🇭",
    "name": "Switzerland: Swiss Red Cross"
  },
  {
    "code": "sy",
    "flag": "🇸🇾",
    "name": "Syria: Syrian Arab Red Crescent"
  },
  {
    "code": "tj",
    "flag": "🇹🇯",
    "name": "Tajikistan: Red Crescent Society of Tajikistan"
  },
  {
    "code": "tz",
    "flag": "🇹🇿",
    "name": "Tanzania: Tanzania Red Cross National Society"
  },
  {
    "code": "th",
    "flag": "🇹🇭",
    "name": "Thailand: Thai Red Cross Society"
  },
  {
    "code": "tl",
    "flag": "🇹🇱",
    "name": "Timor-Leste: Timor-Leste Red Cross Society"
  },
  {
    "code": "tg",
    "flag": "🇹🇬",
    "name": "Togo: Togolese Red Cross"
  },
  {
    "code": "to",
    "flag": "🇹🇴",
    "name": "Tonga: Tonga Red Cross Society"
  },
  {
    "code": "tt",
    "flag": "🇹🇹",
    "name": "Trinidad and Tobago: Trinidad and Tobago Red Cross Society"
  },
  {
    "code": "tn",
    "flag": "🇹🇳",
    "name": "Tunisia: Tunisian Red Crescent"
  },
  {
    "code": "tr",
    "flag": "🇹🇷",
    "name": "Turkey: Turkish Red Crescent"
  },
  {
    "code": "tm",
    "flag": "🇹🇲",
    "name": "Turkmenistan: Red Crescent Society of Turkmenistan"
  },
  {
    "code": "tv",
    "flag": "🇹🇻",
    "name": "Tuvalu: Tuvalu Red Cross Society"
  },
  {
    "code": "ug",
    "flag": "🇺🇬",
    "name": "Uganda: Uganda Red Cross Society"
  },
  {
    "code": "ua",
    "flag": "🇺🇦",
    "name": "Ukraine: Ukrainian Red Cross Society"
  },
  {
    "code": "uy",
    "flag": "🇺🇾",
    "name": "Uruguay: Uruguayan Red Cross"
  },
  {
    "code": "ae",
    "flag": "🇦🇪",
    "name": "United Arab Emirates: Red Crescent Society of the United Arab Emirates"
  },
  {
    "code": "gb",
    "flag": "🇬🇧",
    "name": "United Kingdom: British Red Cross"
  },
  {
    "code": "vg",
    "flag": "🇻🇬",
    "name": "British Virgin Islands: British Virgin Islands Red Cross (autonomous branch of the British Red Cross)"
  },
  {
    "code": "tc",
    "flag": "🇹🇨",
    "name": "Turks & Caicos Islands: Turks & Caicos Red Cross Society (autonomous branch of the British Red Cross)"
  },
  {
    "code": "us",
    "flag": "🇺🇸",
    "name": "United States of America: American Red Cross"
  },
  {
    "code": "uz",
    "flag": "🇺🇿",
    "name": "Uzbekistan: Red Crescent Society of Uzbekistan"
  },
  {
    "code": "vu",
    "flag": "🇻🇺",
    "name": "Vanuatu: Vanuatu Red Cross Society"
  },
  {
    "code": "ve",
    "flag": "🇻🇪",
    "name": "Venezuela: Venezuelan Red Cross"
  },
  {
    "code": "vn",
    "flag": "🇻🇳",
    "name": "Vietnam: Viet Nam Red Cross Society"
  },
  {
    "code": "ye",
    "flag": "🇾🇪",
    "name": "Yemen: Yemen Red Crescent Society"
  },
  {
    "code": "zm",
    "flag": "🇿🇲",
    "name": "Zambia: Zambia Red Cross Society"
  },
  {
    "code": "zw",
    "flag": "🇿🇼",
    "name": "Zimbabwe: Zimbabwe Red Cross Society"
  }
]
