module gitlab.com/act3-ai/asce/go-common

go 1.23

require (
	github.com/MakeNowJust/heredoc/v2 v2.0.1
	github.com/adrg/xdg v0.5.2
	github.com/charmbracelet/x/ansi v0.8.0
	github.com/cpuguy83/go-md2man/v2 v2.0.5
	github.com/gomarkdown/markdown v0.0.0-20240930133441-72d49d9543d8
	github.com/google/uuid v1.6.0
	github.com/iancoleman/strcase v0.3.0
	github.com/invopop/jsonschema v0.12.0
	github.com/muesli/termenv v0.15.2
	github.com/neilotoole/slogt v1.1.0
	github.com/prometheus/client_golang v1.20.5
	github.com/samber/slog-multi v1.3.3
	github.com/spf13/cobra v1.8.1
	github.com/spf13/pflag v1.0.5
	github.com/stretchr/testify v1.10.0
	go.opentelemetry.io/contrib/bridges/otelslog v0.8.0
	go.opentelemetry.io/contrib/exporters/autoexport v0.59.0
	go.opentelemetry.io/otel v1.34.0
	go.opentelemetry.io/otel/exporters/otlp/otlplog/otlploghttp v0.10.0
	go.opentelemetry.io/otel/exporters/otlp/otlptrace/otlptracehttp v1.34.0
	go.opentelemetry.io/otel/sdk v1.34.0
	go.opentelemetry.io/otel/sdk/log v0.10.0
	go.opentelemetry.io/otel/sdk/metric v1.34.0
	go.opentelemetry.io/otel/trace v1.34.0
	golang.org/x/term v0.28.0
	k8s.io/apimachinery v0.31.2
)

require (
	github.com/klauspost/compress v1.17.11 // indirect
	go.opentelemetry.io/contrib/bridges/prometheus v0.59.0 // indirect
	go.opentelemetry.io/otel/exporters/otlp/otlplog/otlploggrpc v0.10.0 // indirect
	go.opentelemetry.io/otel/exporters/otlp/otlpmetric/otlpmetricgrpc v1.34.0 // indirect
	go.opentelemetry.io/otel/exporters/otlp/otlpmetric/otlpmetrichttp v1.34.0 // indirect
	go.opentelemetry.io/otel/exporters/otlp/otlptrace/otlptracegrpc v1.34.0 // indirect
	go.opentelemetry.io/otel/exporters/prometheus v0.56.0 // indirect
	go.opentelemetry.io/otel/exporters/stdout/stdoutlog v0.10.0 // indirect
	go.opentelemetry.io/otel/exporters/stdout/stdoutmetric v1.34.0 // indirect
	go.opentelemetry.io/otel/exporters/stdout/stdouttrace v1.34.0 // indirect
)

require (
	github.com/aymanbagabas/go-osc52/v2 v2.0.1 // indirect
	github.com/bahlo/generic-list-go v0.2.0 // indirect
	github.com/beorn7/perks v1.0.1 // indirect
	github.com/buger/jsonparser v1.1.1 // indirect
	github.com/cenkalti/backoff/v4 v4.3.0 // indirect
	github.com/cespare/xxhash/v2 v2.3.0 // indirect
	github.com/davecgh/go-spew v1.1.2-0.20180830191138-d8f796af33cc // indirect
	github.com/fxamacker/cbor/v2 v2.7.0 // indirect
	github.com/go-logr/logr v1.4.2 // indirect
	github.com/go-logr/stdr v1.2.2 // indirect
	github.com/gogo/protobuf v1.3.2 // indirect
	github.com/google/gofuzz v1.2.0 // indirect
	github.com/grpc-ecosystem/grpc-gateway/v2 v2.25.1 // indirect
	github.com/inconshreveable/mousetrap v1.1.0 // indirect
	github.com/json-iterator/go v1.1.12 // indirect
	github.com/lucasb-eyer/go-colorful v1.2.0 // indirect
	github.com/mailru/easyjson v0.7.7 // indirect
	github.com/mattn/go-isatty v0.0.18 // indirect
	github.com/mattn/go-runewidth v0.0.16 // indirect
	github.com/modern-go/concurrent v0.0.0-20180306012644-bacd9c7ef1dd // indirect
	github.com/modern-go/reflect2 v1.0.2 // indirect
	github.com/munnerz/goautoneg v0.0.0-20191010083416-a7dc8b61c822 // indirect
	github.com/pmezard/go-difflib v1.0.1-0.20181226105442-5d4384ee4fb2 // indirect
	github.com/prometheus/client_model v0.6.1 // indirect
	github.com/prometheus/common v0.62.0 // indirect
	github.com/prometheus/procfs v0.15.1 // indirect
	github.com/rivo/uniseg v0.4.7 // indirect
	github.com/russross/blackfriday/v2 v2.1.0 // indirect
	github.com/samber/lo v1.47.0 // indirect
	github.com/wk8/go-ordered-map/v2 v2.1.8 // indirect
	github.com/x448/float16 v0.8.4 // indirect
	go.opentelemetry.io/auto/sdk v1.1.0 // indirect
	go.opentelemetry.io/otel/exporters/otlp/otlptrace v1.34.0 // indirect
	go.opentelemetry.io/otel/log v0.10.0 // indirect
	go.opentelemetry.io/otel/metric v1.34.0 // indirect
	go.opentelemetry.io/proto/otlp v1.5.0 // indirect
	golang.org/x/net v0.34.0 // indirect
	golang.org/x/sys v0.29.0 // indirect
	golang.org/x/text v0.21.0 // indirect
	google.golang.org/genproto/googleapis/api v0.0.0-20250115164207-1a7da9e5054f // indirect
	google.golang.org/genproto/googleapis/rpc v0.0.0-20250115164207-1a7da9e5054f // indirect
	google.golang.org/grpc v1.69.4 // indirect
	google.golang.org/protobuf v1.36.3 // indirect
	gopkg.in/inf.v0 v0.9.1 // indirect
	gopkg.in/yaml.v2 v2.4.0 // indirect
	gopkg.in/yaml.v3 v3.0.1 // indirect
	k8s.io/klog/v2 v2.130.1 // indirect
	k8s.io/utils v0.0.0-20240921022957-49e7df575cb6 // indirect
	sigs.k8s.io/json v0.0.0-20241014173422-cfa47c3a1cc8 // indirect
	sigs.k8s.io/structured-merge-diff/v4 v4.4.1 // indirect
	sigs.k8s.io/yaml v1.4.0 // indirect
)
