module dagger/go-common

go 1.23.2

require (
	github.com/99designs/gqlgen v0.17.63
	github.com/Khan/genqlient v0.7.0
	github.com/vektah/gqlparser/v2 v2.5.21
	go.opentelemetry.io/otel v1.32.0
	go.opentelemetry.io/otel/exporters/otlp/otlplog/otlploggrpc v0.8.0
	go.opentelemetry.io/otel/exporters/otlp/otlplog/otlploghttp v0.8.0
	go.opentelemetry.io/otel/exporters/otlp/otlpmetric/otlpmetricgrpc v1.32.0
	go.opentelemetry.io/otel/exporters/otlp/otlpmetric/otlpmetrichttp v1.32.0
	go.opentelemetry.io/otel/exporters/otlp/otlptrace/otlptracegrpc v1.32.0
	go.opentelemetry.io/otel/exporters/otlp/otlptrace/otlptracehttp v1.32.0
	go.opentelemetry.io/otel/log v0.8.0
	go.opentelemetry.io/otel/metric v1.32.0
	go.opentelemetry.io/otel/sdk v1.32.0
	go.opentelemetry.io/otel/sdk/log v0.8.0
	go.opentelemetry.io/otel/sdk/metric v1.32.0
	go.opentelemetry.io/otel/trace v1.32.0
	go.opentelemetry.io/proto/otlp v1.3.1
	golang.org/x/sync v0.10.0
	google.golang.org/grpc v1.68.0
)

require (
	go.uber.org/atomic v1.7.0 // indirect
	go.uber.org/multierr v1.9.0 // indirect
)

require (
	github.com/cenkalti/backoff/v4 v4.3.0 // indirect
	github.com/go-logr/logr v1.4.2 // indirect
	github.com/go-logr/stdr v1.2.2 // indirect
	github.com/google/uuid v1.6.0 // indirect
	github.com/grpc-ecosystem/grpc-gateway/v2 v2.23.0 // indirect
	github.com/sosodev/duration v1.3.1 // indirect
	github.com/sourcegraph/conc v0.3.0
	go.opentelemetry.io/otel/exporters/otlp/otlptrace v1.32.0 // indirect
	golang.org/x/net v0.33.0 // indirect
	golang.org/x/sys v0.28.0 // indirect
	golang.org/x/text v0.21.0 // indirect
	google.golang.org/genproto/googleapis/api v0.0.0-20241113202542-65e8d215514f // indirect
	google.golang.org/genproto/googleapis/rpc v0.0.0-20241113202542-65e8d215514f // indirect
	google.golang.org/protobuf v1.36.1 // indirect
)

replace go.opentelemetry.io/otel/exporters/otlp/otlplog/otlploggrpc => go.opentelemetry.io/otel/exporters/otlp/otlplog/otlploggrpc v0.8.0

replace go.opentelemetry.io/otel/exporters/otlp/otlplog/otlploghttp => go.opentelemetry.io/otel/exporters/otlp/otlplog/otlploghttp v0.8.0

replace go.opentelemetry.io/otel/log => go.opentelemetry.io/otel/log v0.8.0

replace go.opentelemetry.io/otel/sdk/log => go.opentelemetry.io/otel/sdk/log v0.8.0
