module gitlab.com/act3-ai/asce/data/schema

go 1.23.5

require (
	github.com/go-ozzo/ozzo-validation/v4 v4.3.0
	github.com/invopop/jsonschema v0.13.0
	github.com/opencontainers/go-digest v1.0.0
	github.com/opencontainers/image-spec v1.1.1
	github.com/stretchr/testify v1.10.0
	gitlab.com/act3-ai/asce/go-common v0.0.0-20250301173836-59817e757a36
	gopkg.in/yaml.v3 v3.0.1
	k8s.io/apimachinery v0.32.3
	sigs.k8s.io/yaml v1.4.0
)

require gopkg.in/check.v1 v1.0.0-20201130134442-10cb98267c6c // indirect

require (
	github.com/MakeNowJust/heredoc/v2 v2.0.1 // indirect
	github.com/adrg/xdg v0.5.3 // indirect
	github.com/asaskevich/govalidator v0.0.0-20230301143203-a9d515a09cc2 // indirect
	github.com/aymanbagabas/go-osc52/v2 v2.0.1 // indirect
	github.com/bahlo/generic-list-go v0.2.0 // indirect
	github.com/buger/jsonparser v1.1.1 // indirect
	github.com/charmbracelet/x/ansi v0.8.0 // indirect
	github.com/cpuguy83/go-md2man/v2 v2.0.6 // indirect
	github.com/davecgh/go-spew v1.1.2-0.20180830191138-d8f796af33cc // indirect
	github.com/fxamacker/cbor/v2 v2.7.0 // indirect
	github.com/go-logr/logr v1.4.2 // indirect
	github.com/gogo/protobuf v1.3.2 // indirect
	github.com/gomarkdown/markdown v0.0.0-20250311123330-531bef5e742b // indirect
	github.com/google/gofuzz v1.2.0 // indirect
	github.com/iancoleman/strcase v0.3.0 // indirect
	github.com/inconshreveable/mousetrap v1.1.0 // indirect
	github.com/json-iterator/go v1.1.12 // indirect
	github.com/lucasb-eyer/go-colorful v1.2.0 // indirect
	github.com/mailru/easyjson v0.9.0 // indirect
	github.com/mattn/go-isatty v0.0.20 // indirect
	github.com/mattn/go-runewidth v0.0.16 // indirect
	github.com/modern-go/concurrent v0.0.0-20180306012644-bacd9c7ef1dd // indirect
	github.com/modern-go/reflect2 v1.0.2 // indirect
	github.com/muesli/termenv v0.16.0 // indirect
	github.com/pmezard/go-difflib v1.0.1-0.20181226105442-5d4384ee4fb2 // indirect
	github.com/rivo/uniseg v0.4.7 // indirect
	github.com/russross/blackfriday/v2 v2.1.0 // indirect
	github.com/spf13/cobra v1.9.1 // indirect
	github.com/spf13/pflag v1.0.6 // indirect
	github.com/wk8/go-ordered-map/v2 v2.1.8 // indirect
	github.com/x448/float16 v0.8.4 // indirect
	golang.org/x/net v0.37.0 // indirect
	golang.org/x/sys v0.31.0 // indirect
	golang.org/x/term v0.30.0 // indirect
	golang.org/x/text v0.23.0 // indirect
	gopkg.in/inf.v0 v0.9.1 // indirect
	k8s.io/klog/v2 v2.130.1 // indirect
	k8s.io/utils v0.0.0-20241210054802-24370beab758 // indirect
	sigs.k8s.io/json v0.0.0-20241014173422-cfa47c3a1cc8 // indirect
	sigs.k8s.io/structured-merge-diff/v4 v4.6.0 // indirect
)
