<?xml version="1.0" standalone="no"?>
<!DOCTYPE svg PUBLIC "-//W3C//DTD SVG 1.1//EN"
"http://www.w3.org/Graphics/SVG/1.1/DTD/svg11.dtd">

<svg width="576" height="294" view_box="0 0 576 294"
xmlns="http://www.w3.org/2000/svg"
xmlns:link="http://www.w3.org/1999/xlink">\n\n<desc>Généré par Mocodo 2.3.7 le Wed, 15 Feb 2017 09:37:50</desc>

<rect id="frame" x="0" y="0" width="576" height="294" fill="none" stroke="none" stroke-width="0"/>

<!-- Association PEUT COHABITER AVEC -->
<path d="M97 156 C 141.0 184.333333333 141.0 218.666666667 97 259" fill="none" stroke="#000000" stroke-width="1"/>
<text x="100.0" y="207" fill="#000000" font-family="Courier New" font-size="12">0,N</text>
<path d="M97 156 C 53.0 184.333333333 53.0 218.666666667 97 259" fill="none" stroke="#000000" stroke-width="1"/>
<text x="71.0" y="207" fill="#000000" font-family="Courier New" font-size="12" onmouseover="show(evt,'commensale')" onmouseout="hide(evt)" style="cursor: pointer;">0,N</text>
<g id="association-PEUT COHABITER AVEC">
	<path d="M 171 233 a 14 14 90 0 1 14 14 V 259 h -176 V 247 a 14 14 90 0 1 14 -14" fill="#FFFFFF" stroke="#FFFFFF" stroke-width="0"/>
	<path d="M 185 259.0 v 12 a 14 14 90 0 1 -14 14 H 23 a 14 14 90 0 1 -14 -14 V 259.0 H 176" fill="#FFFFFF" stroke="#FFFFFF" stroke-width="0"/>
	<rect x="9" y="233" width="176" height="52" fill="none" rx="14" stroke="#000000" stroke-width="1.5"/>
	<line x1="9" y1="259" x2="185" y2="259" stroke="#000000" stroke-width="1"/>
	<text x="16" y="251.6" fill="#000000" font-family="Courier New" font-size="14">PEUT COHABITER AVEC</text>
	<text x="16" y="277.6" fill="#000000" font-family="Courier New" font-size="14">nb. max. commensaux</text>
</g>

<!-- Association DF -->
<line x1="97" y1="156" x2="270" y2="156" stroke="#000000" stroke-width="1"/>
<text x="154" y="172.0" fill="#000000" font-family="Courier New" font-size="12">0,N</text>
<line x1="388" y1="156" x2="270" y2="156" stroke="#000000" stroke-width="1"/>
<text x="295" y="172.0" fill="#000000" font-family="Courier New" font-size="12">1,1</text>
<line x1="295" y1="171.0" x2="318" y2="171.0" stroke="#000000" stroke-width="1"/>
<g id="association-DF">
	<circle cx="270" cy="156" r="16" stroke="#000000" stroke-width="1.5" fill="#FFFFFF"/>
	<text x="261" y="161.0" fill="#000000" font-family="Courier New" font-size="14">DF</text>
</g>

<!-- Association OCCUPE -->
<line x1="388" y1="156" x2="388" y2="44" stroke="#000000" stroke-width="1"/>
<text x="393.0" y="95" fill="#000000" font-family="Courier New" font-size="12">1,N</text>
<line x1="519" y1="44" x2="388" y2="44" stroke="#000000" stroke-width="1"/>
<text x="443" y="60.0" fill="#000000" font-family="Courier New" font-size="12">1,N</text>
<line x1="270" y1="44" x2="388" y2="44" stroke="#000000" stroke-width="1"/>
<text x="327" y="60.0" fill="#000000" font-family="Courier New" font-size="12">1,N</text>
<g id="association-OCCUPE">
	<path d="M 407 18 a 14 14 90 0 1 14 14 V 44 h -66 V 32 a 14 14 90 0 1 14 -14" fill="#FFFFFF" stroke="#FFFFFF" stroke-width="0"/>
	<path d="M 421 44.0 v 12 a 14 14 90 0 1 -14 14 H 369 a 14 14 90 0 1 -14 -14 V 44.0 H 66" fill="#FFFFFF" stroke="#FFFFFF" stroke-width="0"/>
	<rect x="355" y="18" width="66" height="52" fill="none" rx="14" stroke="#000000" stroke-width="1.5"/>
	<line x1="355" y1="44" x2="421" y2="44" stroke="#000000" stroke-width="1"/>
	<text x="362" y="36.6" fill="#000000" font-family="Courier New" font-size="14">OCCUPE</text>
</g>

<!-- Association A PÈRE -->
<path d="M388 156 C 432.0 208.333333333 432.0 242.666666667 388 259" fill="none" stroke="#000000" stroke-width="1"/>
<text x="391.0" y="225" fill="#000000" font-family="Courier New" font-size="12">0,N</text>
<path d="M388 156 C 344.0 208.333333333 344.0 242.666666667 388 259" fill="none" stroke="#000000" stroke-width="1"/>
<text x="362.0" y="225" fill="#000000" font-family="Courier New" font-size="12" onmouseover="show(evt,'père présumé')" onmouseout="hide(evt)" style="cursor: pointer;">0,N</text>
<path d="M 356.602095738 208.997246124 L 359.473925788 222.102687443 L 354.63895408 216.752636174 L 347.840840713 219.157974955 Z" fill="#000000" stroke-width="0"/>
<g id="association-A PÈRE">
	<path d="M 407 233 a 14 14 90 0 1 14 14 V 259 h -66 V 247 a 14 14 90 0 1 14 -14" fill="#FFFFFF" stroke="#FFFFFF" stroke-width="0"/>
	<path d="M 421 259.0 v 12 a 14 14 90 0 1 -14 14 H 369 a 14 14 90 0 1 -14 -14 V 259.0 H 66" fill="#FFFFFF" stroke="#FFFFFF" stroke-width="0"/>
	<rect x="355" y="233" width="66" height="52" fill="none" rx="14" stroke="#000000" stroke-width="1.5"/>
	<line x1="355" y1="259" x2="421" y2="259" stroke="#000000" stroke-width="1"/>
	<text x="362" y="251.6" fill="#000000" font-family="Courier New" font-size="14">A PÈRE</text>
</g>

<!-- Association A MÈRE -->
<path d="M388 156 C 453.0 124.0 496.666666667 124.0 519 156" fill="none" stroke="#000000" stroke-width="1"/>
<text x="458" y="150.0" fill="#000000" font-family="Courier New" font-size="12">0,1</text>
<path d="M388 156 C 453.0 188.0 496.666666667 188.0 519 156" fill="none" stroke="#000000" stroke-width="1"/>
<text x="458" y="170.0" fill="#000000" font-family="Courier New" font-size="12" onmouseover="show(evt,'mère')" onmouseout="hide(evt)" style="cursor: pointer;">0,N</text>
<path d="M 452.993057013 178.638724923 L 465.775814656 174.564279313 L 460.897046585 179.874422636 L 463.922268087 186.420263672 Z" fill="#000000" stroke-width="0"/>
<g id="association-A MÈRE">
	<path d="M 538 130 a 14 14 90 0 1 14 14 V 156 h -66 V 144 a 14 14 90 0 1 14 -14" fill="#FFFFFF" stroke="#FFFFFF" stroke-width="0"/>
	<path d="M 552 156.0 v 12 a 14 14 90 0 1 -14 14 H 500 a 14 14 90 0 1 -14 -14 V 156.0 H 66" fill="#FFFFFF" stroke="#FFFFFF" stroke-width="0"/>
	<rect x="486" y="130" width="66" height="52" fill="none" rx="14" stroke="#000000" stroke-width="1.5"/>
	<line x1="486" y1="156" x2="552" y2="156" stroke="#000000" stroke-width="1"/>
	<text x="493" y="148.6" fill="#000000" font-family="Courier New" font-size="14">A MÈRE</text>
</g>

<!-- Association PEUT VIVRE DANS -->
<line x1="97" y1="156" x2="97" y2="44" stroke="#000000" stroke-width="1"/>
<text x="102.0" y="113" fill="#000000" font-family="Courier New" font-size="12">1,N</text>
<line x1="270" y1="44" x2="97" y2="44" stroke="#000000" stroke-width="1"/>
<text x="190" y="60.0" fill="#000000" font-family="Courier New" font-size="12">1,N</text>
<g id="association-PEUT VIVRE DANS">
	<path d="M 171 18 a 14 14 90 0 1 14 14 V 44 h -176 V 32 a 14 14 90 0 1 14 -14" fill="#FFFFFF" stroke="#FFFFFF" stroke-width="0"/>
	<path d="M 185 44.0 v 12 a 14 14 90 0 1 -14 14 H 23 a 14 14 90 0 1 -14 -14 V 44.0 H 176" fill="#FFFFFF" stroke="#FFFFFF" stroke-width="0"/>
	<rect x="9" y="18" width="176" height="52" fill="none" rx="14" stroke="#000000" stroke-width="1.5"/>
	<line x1="9" y1="44" x2="185" y2="44" stroke="#000000" stroke-width="1"/>
	<text x="33" y="36.6" fill="#000000" font-family="Courier New" font-size="14">PEUT VIVRE DANS</text>
	<text x="16" y="62.6" fill="#000000" font-family="Courier New" font-size="14">nb. max. congénères</text>
</g>

<!-- Entity ENCLOS -->
<g id="entity-ENCLOS">
	<g id="frame-ENCLOS">
		<rect x="218" y="18" width="104" height="26" fill="#FFFFFF" stroke="#FFFFFF" stroke-width="0"/>
		<rect x="218" y="44.0" width="104" height="26" fill="#FFFFFF" stroke="#FFFFFF" stroke-width="0"/>
		<rect x="218" y="18" width="104" height="52" fill="none" stroke="#000000" stroke-width="1.5"/>
		<line x1="218" y1="44" x2="322" y2="44" stroke="#000000" stroke-width="1"/>
	</g>
	<text x="244" y="36.6" fill="#000000" font-family="Courier New" font-size="14">ENCLOS</text>
	<text x="223" y="62.6" fill="#000000" font-family="Courier New" font-size="14">num. enclos</text>
	<line x1="223" y1="65.0" x2="317" y2="65.0" stroke="#000000" stroke-width="1"/>
</g>

<!-- Entity ANIMAL -->
<g id="entity-ANIMAL">
	<g id="frame-ANIMAL">
		<rect x="323" y="103" width="130" height="26" fill="#FFFFFF" stroke="#FFFFFF" stroke-width="0"/>
		<rect x="323" y="129.0" width="130" height="80" fill="#FFFFFF" stroke="#FFFFFF" stroke-width="0"/>
		<rect x="323" y="103" width="130" height="106" fill="none" stroke="#000000" stroke-width="1.5"/>
		<line x1="323" y1="129" x2="453" y2="129" stroke="#000000" stroke-width="1"/>
	</g>
	<text x="362" y="121.6" fill="#000000" font-family="Courier New" font-size="14">ANIMAL</text>
	<text x="328" y="147.6" fill="#000000" font-family="Courier New" font-size="14">nom</text>
	<line x1="328" y1="150.0" x2="354" y2="150.0" style="fill:none;stroke:#000000;stroke-width:1;stroke-dasharray:4;"/>
	<text x="328" y="165.6" fill="#000000" font-family="Courier New" font-size="14">sexe</text>
	<text x="328" y="183.6" fill="#000000" font-family="Courier New" font-size="14">date naissance</text>
	<text x="328" y="201.6" fill="#000000" font-family="Courier New" font-size="14">date décès</text>
</g>

<!-- Entity ESPÈCE -->
<g id="entity-ESPÈCE">
	<g id="frame-ESPÈCE">
		<rect x="45" y="121" width="104" height="26" fill="#FFFFFF" stroke="#FFFFFF" stroke-width="0"/>
		<rect x="45" y="147.0" width="104" height="44" fill="#FFFFFF" stroke="#FFFFFF" stroke-width="0"/>
		<rect x="45" y="121" width="104" height="70" fill="none" stroke="#000000" stroke-width="1.5"/>
		<line x1="45" y1="147" x2="149" y2="147" stroke="#000000" stroke-width="1"/>
	</g>
	<text x="71" y="139.6" fill="#000000" font-family="Courier New" font-size="14">ESPÈCE</text>
	<text x="50" y="165.6" fill="#000000" font-family="Courier New" font-size="14">code espèce</text>
	<line x1="50" y1="168.0" x2="144" y2="168.0" stroke="#000000" stroke-width="1"/>
	<text x="50" y="183.6" fill="#000000" font-family="Courier New" font-size="14">libellé</text>
</g>

<!-- Entity PÉRIODE -->
<g id="entity-PÉRIODE">
	<g id="frame-PÉRIODE">
		<rect x="471" y="9" width="96" height="26" fill="#FFFFFF" stroke="#FFFFFF" stroke-width="0"/>
		<rect x="471" y="35.0" width="96" height="44" fill="#FFFFFF" stroke="#FFFFFF" stroke-width="0"/>
		<rect x="471" y="9" width="96" height="70" fill="none" stroke="#000000" stroke-width="1.5"/>
		<line x1="471" y1="35" x2="567" y2="35" stroke="#000000" stroke-width="1"/>
	</g>
	<text x="489" y="27.6" fill="#000000" font-family="Courier New" font-size="14">PÉRIODE</text>
	<text x="476" y="53.6" fill="#000000" font-family="Courier New" font-size="14">date début</text>
	<line x1="476" y1="56.0" x2="561" y2="56.0" stroke="#000000" stroke-width="1"/>
	<text x="476" y="71.6" fill="#000000" font-family="Courier New" font-size="14">date fin</text>
	<line x1="476" y1="74.0" x2="544" y2="74.0" stroke="#000000" stroke-width="1"/>
</g>

<!-- Annotations -->
<script type="text/ecmascript">
<![CDATA[
	function show(evt, text) {
		var pos = (evt.target.getAttribute("y") < 249) ? "bottom" : "top"
		var annotation = document.getElementById(pos + "_annotation_Xkt1s0RB")
		annotation.textContent = text
		annotation.setAttributeNS(null, "visibility", "visible");
		document.getElementById(pos + "_overlay_Xkt1s0RB").setAttributeNS(null, "visibility", "visible");
	}
	function hide(evt) {
		document.getElementById("top_annotation_Xkt1s0RB").setAttributeNS(null, "visibility", "hidden");
		document.getElementById("top_overlay_Xkt1s0RB").setAttributeNS(null, "visibility", "hidden");
		document.getElementById("bottom_annotation_Xkt1s0RB").setAttributeNS(null, "visibility", "hidden");
		document.getElementById("bottom_overlay_Xkt1s0RB").setAttributeNS(null, "visibility", "hidden");
	}
]]>
</script>
<rect id="top_overlay_Xkt1s0RB" x="0" y="0" width="576" height="40" fill="#000000" stroke-width="0" opacity="0.7" visibility="hidden"/>
<text id="top_annotation_Xkt1s0RB" text-anchor="middle" x="288.0" y="24" fill="#FFFFFF" font-family="Liberation Serif" font-size="14" visibility="hidden"></text>
<rect id="bottom_overlay_Xkt1s0RB" x="0" y="254" width="576" height="40" fill="#000000" stroke-width="0" opacity="0.7" visibility="hidden"/>
<text id="bottom_annotation_Xkt1s0RB" text-anchor="middle" x="288.0" y="278" fill="#FFFFFF" font-family="Liberation Serif" font-size="14" visibility="hidden"></text>
</svg>