<svg id="Group" xmlns="http://www.w3.org/2000/svg" width="326" height="1214" viewBox="0 0 326 1214">
  <metadata><?xpacket begin="﻿" id="W5M0MpCehiHzreSzNTczkc9d"?>
<x:xmpmeta xmlns:x="adobe:ns:meta/" x:xmptk="Adobe XMP Core 5.6-c138 79.159824, 2016/09/14-01:09:01        ">
   <rdf:RDF xmlns:rdf="http://www.w3.org/1999/02/22-rdf-syntax-ns#">
      <rdf:Description rdf:about=""/>
   </rdf:RDF>
</x:xmpmeta>
                                                                                                    
                                                                                                    
                                                                                                    
                                                                                                    
                                                                                                    
                                                                                                    
                                                                                                    
                                                                                                    
                                                                                                    
                                                                                                    
                                                                                                    
                                                                                                    
                                                                                                    
                                                                                                    
                                                                                                    
                                                                                                    
                                                                                                    
                                                                                                    
                                                                                                    
                                                                                                    
                           
<?xpacket end="w"?></metadata>
<defs>
    <style>
      .cls-1 {
        fill: #4c4c4c;
      }

      .cls-1, .cls-2, .cls-3 {
        fill-rule: evenodd;
      }

      .cls-2 {
        fill: #3d3d3d;
      }

      .cls-3 {
        fill: #fff;
      }
    </style>
  </defs>
  <g id="dark">
    <path id="thin_arrow_small" data-name="thin arrow small" class="cls-1" d="M6,989.015H5v-1H6v1Zm1,1H6v-1H7v1Zm1,1H7v-1H8v1Zm1,1H8v-1H9v1Zm-5-4v-1H5v1H4Zm-1,1v-1H4v1H3Zm-1,1v-1H3v1H2Zm-1,1v-1H2v1H1Zm-1,1v-1H1v1H0Zm3-6H4v1H3v-1Zm-1-1H3v1H2v-1Zm-1-1H2v1H1v-1Zm-1-1H1v1H0v-1Zm6,3v1H5v-1H6Zm1-1v1H6v-1H7Zm1-1v1H7v-1H8Zm1-1v1H8v-1H9Z"/>
    <path id="cross_medium" data-name="cross medium" class="cls-2" d="M8,945.984v0.031H7v-1.03H8v1Zm1,1.031H8v-1H9v1Zm1,1H9v-1h1v1Zm1,1H10v-1h1v1Zm1,1H11v-1h1v1Zm1,1H12v-1h1v1Zm1,1H13v-1h1v1Zm1,1H14v-1h1v1Zm-9-6v-1H7v1H6Zm-1,1v-1H6v1H5Zm-1,1v-1H5v1H4Zm-1,1v-1H4v1H3Zm-1,1v-1H3v1H2Zm-1,1v-1H2v1H1Zm-1,1v-1H1v1h-1Zm6-9.026H7v1H6v-1Zm-1-1H6v1H5v-1Zm-1-1H5v1H4v-1Zm-1-.969H4v0.969H3v-0.969Zm-1-1H3v1H2v-1Zm-1-1H2v1H1v-1Zm-1-1H1v1h-1v-1Zm9,5.965v1H8v-1H9Zm1-1v1H9v-1h1Zm1-1v1H10v-1h1Zm1-.969v0.969H11v-0.969h1Zm1-1v1H12v-1h1Zm1-1v1H13v-1h1Zm1-1v1H14v-1h1Z"/>
    <path id="cross_large" data-name="cross large" class="cls-2" d="M13.995,894.984v0.031h-1v-1.03h1v1Zm1,1.031h-1v-1h1v1Zm1,1H15v-1h1v1Zm1,1H16v-1h1v1Zm1,1H17v-1h1v1Zm1,1H18v-1h1v1Zm1,1H19v-1h1v1Zm1,1H20v-1h1v1Zm1,1H21v-1h1v1Zm1,1H22v-1h1v1Zm1,1H23v-1h1v1Zm1,1H24v-1h1v1Zm1,1H25v-1h1v1Zm1,1H26v-1h1v1ZM11.994,896.015v-1h1v1h-1Zm-1,1v-1h1v1h-1Zm-1,1v-1h1v1h-1Zm-1,1v-1h1v1h-1Zm-1,1v-1h1v1h-1Zm-1,1v-1h1v1h-1Zm-1,1v-1h1v1h-1Zm-1,1v-1h1v1h-1Zm-1,1v-1h1v1h-1Zm-1,1v-1h1v1h-1Zm-1,1v-1h1v1h-1Zm-1,1v-1h1v1h-1Zm-1,1v-1h1v1h-1Zm12.006-15.022h1v1h-1v-1Zm-1-1h1v1h-1v-1Zm-1-1h1v1h-1v-1Zm-1-1h1v1h-1v-1Zm-1-1h1v1h-1v-1Zm-1-1h1v1h-1v-1Zm-1-1h1v1h-1v-1Zm-1-1h1v1h-1v-1Zm-1-1h1v1h-1v-1Zm-1-1h1v1h-1v-1Zm-1-1h1v1h-1v-1Zm-1-1h1v1h-1v-1Zm-1-1h1v1h-1v-1ZM15,892.985v1h-1v-1h1Zm1-1v1H15v-1h1Zm1-1v1H16v-1h1Zm1-1v1H17v-1h1Zm1-1v1H18v-1h1Zm1-1v1H19v-1h1Zm1-1v1H20v-1h1Zm1-1v1H21v-1h1Zm1-1v1H22v-1h1Zm1-1v1H23v-1h1Zm1-1v1H24v-1h1Zm1-1v1H25v-1h1Zm1-1v1H26v-1h1Z"/>
    <path id="fat_cross" data-name="fat cross" class="cls-2" d="M30,825.955v0.066h1v1h1v1h1v1h1v1h1v1h1v1h1v1h1v1h1v1h1v1h1v1h1v1h1v1h1v1h1v1h1v1h1v1h1v1h1v1h1v1h1v1h-1v1h-1v1h-1v1h-1v1h-1v-1h-1v-1h-1v-1h-1v-1h-1v-1h-1v-1h-1v-1H39v-1H38v-1H37v-1H36v-1H35v-1H34v-1H33v-1H32v-1H31v-1H30v-1H29v-1H28v-1H27v-1H26v-1H25v1H24v1H23v1H22v1H21v1H20v1H19v1H18v1H17v1H16v1H15v1H14v1H13v1H12v1H11v1H10v1H9v1H8v1H7v1H6v1H5v1H4v-1H3v-1H2v-1H1v-1H0v-1H1v-1H2v-1H3v-1H4v-1H5v-1H6v-1H7v-1H8v-1H9v-1h1v-1h1v-1h1v-1h1v-1h1v-1h1v-1h1v-1h1v-1h1v-1h1v-1h1v-1h1v-1.064H20v-1H19v-1H18v-1H17v-1H16v-1H15v-1H14v-1H13v-1H12v-1H11v-1H10v-1H9v-1H8v-1H7v-1H6v-1H5v-1H4v-1H3v-1H2v-1H1v-1H0v-1H1v-1H2v-1H3v-1H4v-1H5v1H6v1H7v1H8v1H9v1h1v1h1v1h1v1h1v1h1v1h1v1h1v1h1v1h1v1h1v1h1v1h1v1h1v1h1v1h1v1h1v1h1v-1h1v-1h1v-1h1v-1h1v-1h1v-1h1v-1h1v-1h1v-1h1v-1h1v-1h1v-1h1v-1h1v-1h1v-1h1v-1h1v-1h1v-1h1v-1h1v-1h1v-1h1v1h1v1h1v1h1v1h1v1h-1v1h-1v1h-1v1h-1v1h-1v1h-1v1h-1v1h-1v1h-1v1h-1v1h-1v1H39v1H38v1H37v1H36v1H35v1H34v1H33v1H32v1H31v1H30v1Z"/>
    <path id="arrow_small" data-name="arrow small" class="cls-1" d="M147,26v1h-1v1h-1v1h-1v1h-1V29h-1V28h-1V27h-1V26h-1V25h9v1h-1Z"/>
    <path id="arrow_small-2" data-name="arrow small" class="cls-1" d="M147,5h-8V4h1V3h1V2h1V1h1V0h1V1h1V2h1V3h1V4h1V5h-1Z"/>
    <path id="thin_arrow_small-2" data-name="thin arrow small" class="cls-1" d="M4,722H5v1H4v-1Zm0,0H5v1H4v-1Zm-1,1H4v1H3v-1Zm-1,1H3v1H2v-1Zm-1,1H2v1H1v-1Zm-1,1H1v1H0v-1Zm1,1H2v1H1v-1Zm1,1H3v1H2v-1Zm1,1H4v1H3v-1Zm1,1H5v1H4v-1Z"/>
    <path id="thin_arrow_small-3" data-name="thin arrow small" class="cls-1" d="M0,761H1v1H0v-1Zm0,0H1v1H0v-1Zm1,1H2v1H1v-1Zm1,1H3v1H2v-1Zm1,1H4v1H3v-1Zm1,1H5v1H4v-1Zm-1,1H4v1H3v-1Zm-1,1H3v1H2v-1Zm-1,1H2v1H1v-1Zm-1,1H1v1H0v-1Z"/>
    <path id="thin_arrow_small-4" data-name="thin arrow small" class="cls-1" d="M0,687H1v1H0v-1Zm0,0H1v1H0v-1Zm1,1H2v1H1v-1Zm1,1H3v1H2v-1Zm1,1H4v1H3v-1Zm1,1H5v1H4v-1Zm1-1H6v1H5v-1Zm1-1H7v1H6v-1Zm1-1H8v1H7v-1Zm1-1H9v1H8v-1Z"/>
    <path id="thin_arrow_small-5" data-name="thin arrow small" class="cls-1" d="M8,656H9v1H8v-1Zm0,0H9v1H8v-1Zm-1-1H8v1H7v-1Zm-1-1H7v1H6v-1Zm-1-1H6v1H5v-1Zm-1-1H5v1H4v-1Zm-1,1H4v1H3v-1Zm-1,1H3v1H2v-1Zm-1,1H2v1H1v-1Zm-1,1H1v1H0v-1Z"/>
    <path id="thin_tail_arrow_small" data-name="thin tail arrow small" class="cls-1" d="M88,437h1v1H88v-1Zm0,0h1v1H88v-1Zm-1-1h1v1H87v-1Zm-1-1h1v1H86v-1Zm-1-1h1v1H85v-1Zm-1-1h1v1H84v-1Zm-1,1h1v1H83v-1Zm-1,1h1v1H82v-1Zm-1,1h1v1H81v-1Zm-1,1h1v1H80v-1Zm4-3h1v10H84V434Z"/>
    <path id="thin_tail_arrow_small-2" data-name="thin tail arrow small" class="cls-1" d="M84,515h1v1H84v-1Zm0,0h1v1H84v-1Zm-1,1h1v1H83v-1Zm-1,1h1v1H82v-1Zm-1,1h1v1H81v-1Zm-1,1h1v1H80v-1Zm1,1h1v1H81v-1Zm1,1h1v1H82v-1Zm1,1h1v1H83v-1Zm1,1h1v1H84v-1Zm-4-4H90v1H80v-1Z"/>
    <path id="thin_tail_arrow_small-3" data-name="thin tail arrow small" class="cls-1" d="M85,554h1v1H85v-1Zm0,0h1v1H85v-1Zm1,1h1v1H86v-1Zm1,1h1v1H87v-1Zm1,1h1v1H88v-1Zm1,1h1v1H89v-1Zm-1,1h1v1H88v-1Zm-1,1h1v1H87v-1Zm-1,1h1v1H86v-1Zm-1,1h1v1H85v-1Zm-5-4H90v1H80v-1Z"/>
    <path id="thin_tail_arrow_small-4" data-name="thin tail arrow small" class="cls-1" d="M80,480h1v1H80v-1Zm0,0h1v1H80v-1Zm1,1h1v1H81v-1Zm1,1h1v1H82v-1Zm1,1h1v1H83v-1Zm1,1h1v1H84v-1Zm1-1h1v1H85v-1Zm1-1h1v1H86v-1Zm1-1h1v1H87v-1Zm1-1h1v1H88v-1Zm-4-6h1v10H84V474Z"/>
    <path id="thin_tail_arrow_medium" data-name="thin tail arrow medium" class="cls-2" d="M89,283h1v21H89V283Zm-8,13h1v1H81v-1Zm1,1h1v1H82v-1Zm1,1h1v1H83v-1Zm1,1h1v1H84v-1Zm1,1h1v1H85v-1Zm1,1h1v1H86v-1Zm1,1h1v1H87v-1Zm1,1h1v1H88v-1Zm1,1h1v1H89v-1Zm1-1h1v1H90v-1Zm1-1h1v1H91v-1Zm1-1h1v1H92v-1Zm1-1h1v1H93v-1Zm1-1h1v1H94v-1Zm1-1h1v1H95v-1Zm1-1h1v1H96v-1Zm1-1h1v1H97v-1Zm-17-1h1v1H80v-1Zm18,0h1v1H98v-1Z"/>
    <path id="thin_tail_arrow_medium-2" data-name="thin tail arrow medium" class="cls-2" d="M89,232h1v21H89V232Zm-8,7h1v1H81v-1Zm1-1h1v1H82v-1Zm1-1h1v1H83v-1Zm1-1h1v1H84v-1Zm1-1h1v1H85v-1Zm1-1h1v1H86v-1Zm1-1h1v1H87v-1Zm1-1h1v1H88v-1Zm1-1h1v1H89v-1Zm1,1h1v1H90v-1Zm1,1h1v1H91v-1Zm1,1h1v1H92v-1Zm1,1h1v1H93v-1Zm1,1h1v1H94v-1Zm1,1h1v1H95v-1Zm1,1h1v1H96v-1Zm1,1h1v1H97v-1Zm-17,1h1v1H80v-1Zm18,0h1v1H98v-1Z"/>
    <path id="thin_tail_arrow_medium-3" data-name="thin tail arrow medium" class="cls-2" d="M80,393h21v1H80v-1Zm13,8h1v1H93v-1Zm1-1h1v1H94v-1Zm1-1h1v1H95v-1Zm1-1h1v1H96v-1Zm1-1h1v1H97v-1Zm1-1h1v1H98v-1Zm1-1h1v1H99v-1Zm1-1h1v1h-1v-1Zm1-1h1v1h-1v-1Zm-1-1h1v1h-1v-1Zm-1-1h1v1H99v-1Zm-1-1h1v1H98v-1Zm-1-1h1v1H97v-1Zm-1-1h1v1H96v-1Zm-1-1h1v1H95v-1Zm-1-1h1v1H94v-1Zm-1-1h1v1H93v-1Zm-1,17h1v1H92v-1Zm0-18h1v1H92v-1Z"/>
    <path id="thin_tail_arrow_medium-4" data-name="thin tail arrow medium" class="cls-2" d="M81,344h21v1H81v-1Zm7,8h1v1H88v-1Zm-1-1h1v1H87v-1Zm-1-1h1v1H86v-1Zm-1-1h1v1H85v-1Zm-1-1h1v1H84v-1Zm-1-1h1v1H83v-1Zm-1-1h1v1H82v-1Zm-1-1h1v1H81v-1Zm-1-1h1v1H80v-1Zm1-1h1v1H81v-1Zm1-1h1v1H82v-1Zm1-1h1v1H83v-1Zm1-1h1v1H84v-1Zm1-1h1v1H85v-1Zm1-1h1v1H86v-1Zm1-1h1v1H87v-1Zm1-1h1v1H88v-1Zm1,17h1v1H89v-1Zm0-18h1v1H89v-1Z"/>
    <path id="thin_tail_arrow_large" data-name="thin tail arrow large" class="cls-2" d="M93,64h1V85H93V64ZM85,77h1v1H85V77Zm1,1h1v1H86V78Zm1,1h1v1H87V79Zm1,1h1v1H88V80Zm1,1h1v1H89V81Zm1,1h1v1H90V82Zm1,1h1v1H91V83Zm1,1h1v1H92V84Zm1,1h1v1H93V85Zm1-1h1v1H94V84Zm1-1h1v1H95V83Zm1-1h1v1H96V82Zm1-1h1v1H97V81Zm1-1h1v1H98V80Zm1-1h1v1H99V79Zm1-1h1v1h-1V78Zm1-1h1v1h-1V77ZM84,76h1v1H84V76Zm18,0h1v1h-1V76Zm1-1h1v1h-1V75Zm1-1h1v1h-1V74Zm1-1h1v1h-1V73Zm1-1h1v1h-1V72ZM83,75h1v1H83V75Zm-1-1h1v1H82V74Zm-1-1h1v1H81V73Zm-1-1h1v1H80V72Zm13-9h1V84H93V63Zm0-1h1V83H93V62Zm0-1h1V82H93V61Zm0-1h1V81H93V60Zm0-1h1V80H93V59Zm0-1h1V79H93V58Z"/>
    <path id="thin_tail_arrow_large-2" data-name="thin tail arrow large" class="cls-2" d="M93,1h1V22H93V1ZM85,8h1V9H85V8Zm1-1h1V8H86V7Zm1-1h1V7H87V6Zm1-1h1V6H88V5Zm1-1h1V5H89V4Zm1-1h1V4H90V3Zm1-1h1V3H91V2Zm1-1h1V2H92V1Zm1-1h1V1H93V0Zm1,1h1V2H94V1Zm1,1h1V3H95V2Zm1,1h1V4H96V3Zm1,1h1V5H97V4Zm1,1h1V6H98V5Zm1,1h1V7H99V6Zm1,1h1V8h-1V7Zm1,1h1V9h-1V8ZM84,9h1v1H84V9Zm18,0h1v1h-1V9Zm1,1h1v1h-1V10Zm1,1h1v1h-1V11Zm1,1h1v1h-1V12Zm1,1h1v1h-1V13ZM83,10h1v1H83V10Zm-1,1h1v1H82V11Zm-1,1h1v1H81V12Zm-1,1h1v1H80V13ZM93,2h1V23H93V2Zm0,1h1V24H93V3Zm0,1h1V25H93V4Zm0,1h1V26H93V5Zm0,1h1V27H93V6Zm0,1h1V28H93V7Z"/>
    <path id="thin_tail_arrow_large-3" data-name="thin tail arrow large" class="cls-2" d="M86,186h21v1H86v-1Zm13,8h1v1H99v-1Zm1-1h1v1h-1v-1Zm1-1h1v1h-1v-1Zm1-1h1v1h-1v-1Zm1-1h1v1h-1v-1Zm1-1h1v1h-1v-1Zm1-1h1v1h-1v-1Zm1-1h1v1h-1v-1Zm1-1h1v1h-1v-1Zm-1-1h1v1h-1v-1Zm-1-1h1v1h-1v-1Zm-1-1h1v1h-1v-1Zm-1-1h1v1h-1v-1Zm-1-1h1v1h-1v-1Zm-1-1h1v1h-1v-1Zm-1-1h1v1h-1v-1Zm-1-1h1v1H99v-1Zm-1,17h1v1H98v-1Zm0-18h1v1H98v-1Zm-1-1h1v1H97v-1Zm-1-1h1v1H96v-1Zm-1-1h1v1H95v-1Zm-1-1h1v1H94v-1Zm3,23h1v1H97v-1Zm-1,1h1v1H96v-1Zm-1,1h1v1H95v-1Zm-1,1h1v1H94v-1Zm-9-13h21v1H85v-1Zm-1,0h21v1H84v-1Zm-1,0h21v1H83v-1Zm-1,0h21v1H82v-1Zm-1,0h21v1H81v-1Zm-1,0h21v1H80v-1Z"/>
    <path id="thin_tail_arrow_large-4" data-name="thin tail arrow large" class="cls-2" d="M81,129h21v1H81v-1Zm7,8h1v1H88v-1Zm-1-1h1v1H87v-1Zm-1-1h1v1H86v-1Zm-1-1h1v1H85v-1Zm-1-1h1v1H84v-1Zm-1-1h1v1H83v-1Zm-1-1h1v1H82v-1Zm-1-1h1v1H81v-1Zm-1-1h1v1H80v-1Zm1-1h1v1H81v-1Zm1-1h1v1H82v-1Zm1-1h1v1H83v-1Zm1-1h1v1H84v-1Zm1-1h1v1H85v-1Zm1-1h1v1H86v-1Zm1-1h1v1H87v-1Zm1-1h1v1H88v-1Zm1,17h1v1H89v-1Zm0-18h1v1H89v-1Zm1-1h1v1H90v-1Zm1-1h1v1H91v-1Zm1-1h1v1H92v-1Zm1-1h1v1H93v-1Zm-3,23h1v1H90v-1Zm1,1h1v1H91v-1Zm1,1h1v1H92v-1Zm1,1h1v1H93v-1ZM82,129h21v1H82v-1Zm1,0h21v1H83v-1Zm1,0h21v1H84v-1Zm1,0h21v1H85v-1Zm1,0h21v1H86v-1Zm1,0h21v1H87v-1Z"/>
    <path id="thin_arrow_medium" data-name="thin arrow medium" class="cls-2" d="M14,491h1v1H14v-1Zm-1-1h1v1H13v-1Zm-1-1h1v1H12v-1Zm-1-1h1v1H11v-1Zm-1-1h1v1H10v-1Zm-1-1h1v1H9v-1Zm-1-1H9v1H8v-1Zm-1-1H8v1H7v-1Zm-1,1H7v1H6v-1Zm-1,1H6v1H5v-1Zm-1,1H5v1H4v-1Zm-1,1H4v1H3v-1Zm-1,1H3v1H2v-1Zm-1,1H2v1H1v-1Zm-1,1H1v1H0v-1Z"/>
    <path id="thin_arrow_medium-2" data-name="thin arrow medium" class="cls-2" d="M7,560H8v1H7v-1Zm-1,1H7v1H6v-1Zm-1,1H6v1H5v-1Zm-1,1H5v1H4v-1Zm-1,1H4v1H3v-1Zm-1,1H3v1H2v-1Zm-1,1H2v1H1v-1Zm-1,1H1v1H0v-1Zm1,1H2v1H1v-1Zm1,1H3v1H2v-1Zm1,1H4v1H3v-1Zm1,1H5v1H4v-1Zm1,1H6v1H5v-1Zm1,1H7v1H6v-1Zm1,1H8v1H7v-1Z"/>
    <path id="thin_arrow_medium-3" data-name="thin arrow medium" class="cls-2" d="M0,607H1v1H0v-1Zm1,1H2v1H1v-1Zm1,1H3v1H2v-1Zm1,1H4v1H3v-1Zm1,1H5v1H4v-1Zm1,1H6v1H5v-1Zm1,1H7v1H6v-1Zm1,1H8v1H7v-1Zm-1,1H7v1H6v-1Zm-1,1H6v1H5v-1Zm-1,1H5v1H4v-1Zm-1,1H4v1H3v-1Zm-1,1H3v1H2v-1Zm-1,1H2v1H1v-1Zm-1,1H1v1H0v-1Z"/>
    <path id="thin_arrow_medium-4" data-name="thin arrow medium" class="cls-2" d="M14,522h1v1H14v-1Zm-1,1h1v1H13v-1Zm-1,1h1v1H12v-1Zm-1,1h1v1H11v-1Zm-1,1h1v1H10v-1Zm-1,1h1v1H9v-1Zm-1,1H9v1H8v-1Zm-1,1H8v1H7v-1Zm-1-1H7v1H6v-1Zm-1-1H6v1H5v-1Zm-1-1H5v1H4v-1Zm-1-1H4v1H3v-1Zm-1-1H3v1H2v-1Zm-1-1H2v1H1v-1Zm-1-1H1v1H0v-1Z"/>
    <path id="thin_arrow_large" data-name="thin arrow large" class="cls-2" d="M21,290h1v1H21v-1Zm-1-1h1v1H20v-1Zm-1-1h1v1H19v-1Zm-1-1h1v1H18v-1Zm-1-1h1v1H17v-1Zm-1-1h1v1H16v-1Zm-1-1h1v1H15v-1Zm-1-1h1v1H14v-1Zm-1-1h1v1H13v-1Zm-1,1h1v1H12v-1Zm-1,1h1v1H11v-1Zm-1,1h1v1H10v-1Zm-1,1h1v1H9v-1Zm-1,1H9v1H8v-1Zm-1,1H8v1H7v-1Zm-1,1H7v1H6v-1Zm-1,1H6v1H5v-1Zm17,1h1v1H22v-1ZM4,291H5v1H4v-1Zm19,1h1v1H23v-1Zm1,1h1v1H24v-1Zm1,1h1v1H25v-1Zm1,1h1v1H26v-1ZM3,292H4v1H3v-1Zm-1,1H3v1H2v-1Zm-1,1H2v1H1v-1Zm-1,1H1v1H0v-1Z"/>
    <path id="thin_arrow_large-2" data-name="thin arrow large" class="cls-2" d="M8,375H9v1H8v-1Zm-1,1H8v1H7v-1Zm-1,1H7v1H6v-1Zm-1,1H6v1H5v-1Zm-1,1H5v1H4v-1Zm-1,1H4v1H3v-1Zm-1,1H3v1H2v-1Zm-1,1H2v1H1v-1Zm-1,1H1v1H0v-1Zm1,1H2v1H1v-1Zm1,1H3v1H2v-1Zm1,1H4v1H3v-1Zm1,1H5v1H4v-1Zm1,1H6v1H5v-1Zm1,1H7v1H6v-1Zm1,1H8v1H7v-1Zm1,1H9v1H8v-1Zm1-17h1v1H9v-1Zm0,18h1v1H9v-1Zm1-19h1v1H10v-1Zm1-1h1v1H11v-1Zm1-1h1v1H12v-1Zm1-1h1v1H13v-1Zm-3,23h1v1H10v-1Zm1,1h1v1H11v-1Zm1,1h1v1H12v-1Zm1,1h1v1H13v-1Z"/>
    <path id="thin_arrow_large-3" data-name="thin arrow large" class="cls-2" d="M5,432H6v1H5v-1Zm1,1H7v1H6v-1Zm1,1H8v1H7v-1Zm1,1H9v1H8v-1Zm1,1h1v1H9v-1Zm1,1h1v1H10v-1Zm1,1h1v1H11v-1Zm1,1h1v1H12v-1Zm1,1h1v1H13v-1Zm-1,1h1v1H12v-1Zm-1,1h1v1H11v-1Zm-1,1h1v1H10v-1Zm-1,1h1v1H9v-1Zm-1,1H9v1H8v-1Zm-1,1H8v1H7v-1Zm-1,1H7v1H6v-1Zm-1,1H6v1H5v-1ZM4,431H5v1H4v-1Zm0,18H5v1H4v-1ZM3,430H4v1H3v-1Zm-1-1H3v1H2v-1Zm-1-1H2v1H1v-1Zm-1-1H1v1H0v-1Zm3,23H4v1H3v-1Zm-1,1H3v1H2v-1Zm-1,1H2v1H1v-1Zm-1,1H1v1H0v-1Z"/>
    <path id="thin_arrow_large-4" data-name="thin arrow large" class="cls-2" d="M21,331h1v1H21v-1Zm-1,1h1v1H20v-1Zm-1,1h1v1H19v-1Zm-1,1h1v1H18v-1Zm-1,1h1v1H17v-1Zm-1,1h1v1H16v-1Zm-1,1h1v1H15v-1Zm-1,1h1v1H14v-1Zm-1,1h1v1H13v-1Zm-1-1h1v1H12v-1Zm-1-1h1v1H11v-1Zm-1-1h1v1H10v-1Zm-1-1h1v1H9v-1Zm-1-1H9v1H8v-1Zm-1-1H8v1H7v-1Zm-1-1H7v1H6v-1Zm-1-1H6v1H5v-1Zm17-1h1v1H22v-1ZM4,330H5v1H4v-1Zm19-1h1v1H23v-1Zm1-1h1v1H24v-1Zm1-1h1v1H25v-1Zm1-1h1v1H26v-1ZM3,329H4v1H3v-1Zm-1-1H3v1H2v-1Zm-1-1H2v1H1v-1Zm-1-1H1v1H0v-1Z"/>
    <path id="fat_arrow" data-name="fat arrow" class="cls-2" d="M50,25V24H49V23H48V22H47V21H46V20H45V19H44V18H43V17H42V16H41V15H40V14H39V13H38V12H37V11H36V10H35V9H34V8H33V7H32V6H31V5H30V4H29V3H28V2H27V1H26V0H25V1H24V2H23V3H22V4H21V5H20V6H19V7H18V8H17V9H16v1H15v1H14v1H13v1H12v1H11v1H10v1H9v1H8v1H7v1H6v1H5v1H4v1H3v1H2v1H1v1H0v1H1v1H2v1H3v1H4v1H5V29H6V28H7V27H8V26H9V25h1V24h1V23h1V22h1V21h1V20h1V19h1V18h1V17h1V16h1V15h1V14h1V13h1V12h1V11h1V10h1V9h1v1h1v1h1v1h1v1h1v1h1v1h1v1h1v1h1v1h1v1h1v1h1v1h1v1h1v1h1v1h1v1h1v1h1v1h1v1h1v1h1v1h1V29h1V28h1V27h1V26h1V25H50Z"/>
    <path id="fat_arrow-2" data-name="fat arrow" class="cls-2" d="M5,251H6v-1H7v-1H8v-1H9v-1h1v-1h1v-1h1v-1h1v-1h1v-1h1v-1h1v-1h1v-1h1v-1h1v-1h1v-1h1v-1h1v-1h1v-1h1v-1h1v-1h1v-1h1v-1h1v-1h1v-1h1v-1H29v-1H28v-1H27v-1H26v-1H25v-1H24v-1H23v-1H22v-1H21v-1H20v-1H19v-1H18v-1H17v-1H16v-1H15v-1H14v-1H13v-1H12v-1H11v-1H10v-1H9v-1H8v-1H7v-1H6v-1H5v-1H4v1H3v1H2v1H1v1H0v1H1v1H2v1H3v1H4v1H5v1H6v1H7v1H8v1H9v1h1v1h1v1h1v1h1v1h1v1h1v1h1v1h1v1h1v1h1v1h1v1h1v1H20v1H19v1H18v1H17v1H16v1H15v1H14v1H13v1H12v1H11v1H10v1H9v1H8v1H7v1H6v1H5v1H4v1H3v1H2v1H1v1H0v1H1v1H2v1H3v1H4v1H5v-1Z"/>
    <path id="fat_arrow-3" data-name="fat arrow" class="cls-2" d="M25,170H24v-1H23v-1H22v-1H21v-1H20v-1H19v-1H18v-1H17v-1H16v-1H15v-1H14v-1H13v-1H12v-1H11v-1H10v-1H9v-1H8v-1H7v-1H6v-1H5v-1H4v-1H3v-1H2v-1H1v-1H0v-1H1v-1H2v-1H3v-1H4v-1H5v-1H6v-1H7v-1H8v-1H9v-1h1v-1h1v-1h1v-1h1v-1h1v-1h1v-1h1v-1h1v-1h1v-1h1v-1h1v-1h1v-1h1v-1h1v-1h1v-1h1v-1h1v1h1v1h1v1h1v1h1v1H29v1H28v1H27v1H26v1H25v1H24v1H23v1H22v1H21v1H20v1H19v1H18v1H17v1H16v1H15v1H14v1H13v1H12v1H11v1H10v1H9v1h1v1h1v1h1v1h1v1h1v1h1v1h1v1h1v1h1v1h1v1h1v1h1v1h1v1h1v1h1v1h1v1h1v1h1v1h1v1h1v1h1v1H29v1H28v1H27v1H26v1H25v-1Z"/>
    <path id="fat_arrow-4" data-name="fat arrow" class="cls-2" d="M50,65v1H49v1H48v1H47v1H46v1H45v1H44v1H43v1H42v1H41v1H40v1H39v1H38v1H37v1H36v1H35v1H34v1H33v1H32v1H31v1H30v1H29v1H28v1H27v1H26v1H25V89H24V88H23V87H22V86H21V85H20V84H19V83H18V82H17V81H16V80H15V79H14V78H13V77H12V76H11V75H10V74H9V73H8V72H7V71H6V70H5V69H4V68H3V67H2V66H1V65H0V64H1V63H2V62H3V61H4V60H5v1H6v1H7v1H8v1H9v1h1v1h1v1h1v1h1v1h1v1h1v1h1v1h1v1h1v1h1v1h1v1h1v1h1v1h1v1h1v1h1v1h1V80h1V79h1V78h1V77h1V76h1V75h1V74h1V73h1V72h1V71h1V70h1V69h1V68h1V67h1V66h1V65h1V64h1V63h1V62h1V61h1V60h1v1h1v1h1v1h1v1h1v1H50Z"/>
    <path id="fat_plus" data-name="fat plus" class="cls-2" d="M51,1051H29v22H22v-22H0v-7H22v-22h7v22H51v7Z"/>
    <path id="plus_large" data-name="plus large" class="cls-2" d="M27,1117H14v13H13v-13H0v-1H13v-13h1v13H27v1Z"/>
    <path id="plus_medium" data-name="plus medium" class="cls-2" d="M15,1168H8v7H7v-7H0v-1H7v-7H8v7h7v1Z"/>
    <path id="plus_small" data-name="plus small" class="cls-2" d="M9,1210H5v4H4v-4H0v-1H4v-4H5v4H9v1Z"/>
  </g>
  <g id="light">
    <path id="thin_arrow_small_copy" data-name="thin arrow small copy" class="cls-3" d="M184,989.015h-1v-1h1v1Zm1,1h-1v-1h1v1Zm1,1h-1v-1h1v1Zm1,1h-1v-1h1v1Zm-5-4v-1h1v1h-1Zm-1,1v-1h1v1h-1Zm-1,1v-1h1v1h-1Zm-1,1v-1h1v1h-1Zm-1,1v-1h1v1h-1Zm3-6h1v1h-1v-1Zm-1-1h1v1h-1v-1Zm-1-1h1v1h-1v-1Zm-1-1h1v1h-1v-1Zm6,3v1h-1v-1h1Zm1-1v1h-1v-1h1Zm1-1v1h-1v-1h1Zm1-1v1h-1v-1h1Z"/>
    <path id="cross_medium_copy" data-name="cross medium copy" class="cls-3" d="M186,945.984v0.031h-1v-1.03h1v1Zm1,1.031h-1v-1h1v1Zm1,1h-1v-1h1v1Zm1,1h-1v-1h1v1Zm1,1h-1v-1h1v1Zm1,1h-1v-1h1v1Zm1,1h-1v-1h1v1Zm1,1h-1v-1h1v1Zm-9-6v-1h1v1h-1Zm-1,1v-1h1v1h-1Zm-1,1v-1h1v1h-1Zm-1,1v-1h1v1h-1Zm-1,1v-1h1v1h-1Zm-1,1v-1h1v1h-1Zm-1,1v-1h1v1h-1Zm6-9.026h1v1h-1v-1Zm-1-1h1v1h-1v-1Zm-1-1h1v1h-1v-1Zm-1-.969h1v0.969h-1v-0.969Zm-1-1h1v1h-1v-1Zm-1-1h1v1h-1v-1Zm-1-1h1v1h-1v-1Zm9,5.965v1h-1v-1h1Zm1-1v1h-1v-1h1Zm1-1v1h-1v-1h1Zm1-.969v0.969h-1v-0.969h1Zm1-1v1h-1v-1h1Zm1-1v1h-1v-1h1Zm1-1v1h-1v-1h1Z"/>
    <path id="cross_large_copy" data-name="cross large copy" class="cls-3" d="M192,894.984v0.031h-1v-1.03h1v1Zm1,1.031h-1v-1h1v1Zm1,1h-1v-1h1v1Zm1,1h-1v-1h1v1Zm1,1h-1v-1h1v1Zm1,1h-1v-1h1v1Zm1,1h-1v-1h1v1Zm1,1h-1v-1h1v1Zm1,1h-1v-1h1v1Zm1,1h-1v-1h1v1Zm1,1h-1v-1h1v1Zm1,1h-1v-1h1v1Zm1,1h-1v-1h1v1Zm1,1h-1v-1h1v1Zm-15.007-11.992v-1h1v1h-1Zm-1,1v-1h1v1h-1Zm-1,1v-1h1v1h-1Zm-1,1v-1h1v1h-1Zm-1,1v-1h1v1h-1Zm-1,1v-1h1v1h-1Zm-1,1v-1h1v1h-1Zm-1,1v-1h1v1h-1Zm-1,1v-1h1v1h-1Zm-1,1v-1h1v1h-1Zm-1,1v-1h1v1h-1Zm-1,1v-1h1v1h-1Zm-1,1v-1h1v1h-1Zm12.006-15.022h1v1h-1v-1Zm-1-1h1v1h-1v-1Zm-1-1h1v1h-1v-1Zm-1-1h1v1h-1v-1Zm-1-1h1v1h-1v-1Zm-1-1h1v1h-1v-1Zm-1-1h1v1h-1v-1Zm-1-1h1v1h-1v-1Zm-1-1h1v1h-1v-1Zm-1-1h1v1h-1v-1Zm-1-1h1v1h-1v-1Zm-1-1h1v1h-1v-1Zm-1-1h1v1h-1v-1ZM193,892.985v1h-1v-1h1Zm1-1v1h-1v-1h1Zm1-1v1h-1v-1h1Zm1-1v1h-1v-1h1Zm1-1v1h-1v-1h1Zm1-1v1h-1v-1h1Zm1-1v1h-1v-1h1Zm1-1v1h-1v-1h1Zm1-1v1h-1v-1h1Zm1-1v1h-1v-1h1Zm1-1v1h-1v-1h1Zm1-1v1h-1v-1h1Zm1-1v1h-1v-1h1Z"/>
    <path id="fat_cross_copy" data-name="fat cross copy" class="cls-3" d="M208,825.955v0.066h1v1h1v1h1v1h1v1h1v1h1v1h1v1h1v1h1v1h1v1h1v1h1v1h1v1h1v1h1v1h1v1h1v1h1v1h1v1h1v1h1v1h-1v1h-1v1h-1v1h-1v1h-1v-1h-1v-1h-1v-1h-1v-1h-1v-1h-1v-1h-1v-1h-1v-1h-1v-1h-1v-1h-1v-1h-1v-1h-1v-1h-1v-1h-1v-1h-1v-1h-1v-1h-1v-1h-1v-1h-1v-1h-1v-1h-1v1h-1v1h-1v1h-1v1h-1v1h-1v1h-1v1h-1v1h-1v1h-1v1h-1v1h-1v1h-1v1h-1v1h-1v1h-1v1h-1v1h-1v1h-1v1h-1v1h-1v1h-1v-1h-1v-1h-1v-1h-1v-1h-1v-1h1v-1h1v-1h1v-1h1v-1h1v-1h1v-1h1v-1h1v-1h1v-1h1v-1h1v-1h1v-1h1v-1h1v-1h1v-1h1v-1h1v-1h1v-1h1v-1h1v-1h1v-1.064h-1v-1h-1v-1h-1v-1h-1v-1h-1v-1h-1v-1h-1v-1h-1v-1h-1v-1h-1v-1h-1v-1h-1v-1h-1v-1h-1v-1h-1v-1h-1v-1h-1v-1h-1v-1h-1v-1h-1v-1h-1v-1h1v-1h1v-1h1v-1h1v-1h1v1h1v1h1v1h1v1h1v1h1v1h1v1h1v1h1v1h1v1h1v1h1v1h1v1h1v1h1v1h1v1h1v1h1v1h1v1h1v1h1v1h1v-1h1v-1h1v-1h1v-1h1v-1h1v-1h1v-1h1v-1h1v-1h1v-1h1v-1h1v-1h1v-1h1v-1h1v-1h1v-1h1v-1h1v-1h1v-1h1v-1h1v-1h1v1h1v1h1v1h1v1h1v1h-1v1h-1v1h-1v1h-1v1h-1v1h-1v1h-1v1h-1v1h-1v1h-1v1h-1v1h-1v1h-1v1h-1v1h-1v1h-1v1h-1v1h-1v1h-1v1h-1v1h-1v1Z"/>
    <path id="arrow_small-3" data-name="arrow small" class="cls-3" d="M325,26v1h-1v1h-1v1h-1v1h-1V29h-1V28h-1V27h-1V26h-1V25h9v1h-1Z"/>
    <path id="arrow_small-4" data-name="arrow small" class="cls-3" d="M325,5h-8V4h1V3h1V2h1V1h1V0h1V1h1V2h1V3h1V4h1V5h-1Z"/>
    <path id="thin_arrow_small-6" data-name="thin arrow small" class="cls-3" d="M182,722h1v1h-1v-1Zm0,0h1v1h-1v-1Zm-1,1h1v1h-1v-1Zm-1,1h1v1h-1v-1Zm-1,1h1v1h-1v-1Zm-1,1h1v1h-1v-1Zm1,1h1v1h-1v-1Zm1,1h1v1h-1v-1Zm1,1h1v1h-1v-1Zm1,1h1v1h-1v-1Z"/>
    <path id="thin_arrow_small-7" data-name="thin arrow small" class="cls-3" d="M178,761h1v1h-1v-1Zm0,0h1v1h-1v-1Zm1,1h1v1h-1v-1Zm1,1h1v1h-1v-1Zm1,1h1v1h-1v-1Zm1,1h1v1h-1v-1Zm-1,1h1v1h-1v-1Zm-1,1h1v1h-1v-1Zm-1,1h1v1h-1v-1Zm-1,1h1v1h-1v-1Z"/>
    <path id="thin_arrow_small-8" data-name="thin arrow small" class="cls-3" d="M178,687h1v1h-1v-1Zm0,0h1v1h-1v-1Zm1,1h1v1h-1v-1Zm1,1h1v1h-1v-1Zm1,1h1v1h-1v-1Zm1,1h1v1h-1v-1Zm1-1h1v1h-1v-1Zm1-1h1v1h-1v-1Zm1-1h1v1h-1v-1Zm1-1h1v1h-1v-1Z"/>
    <path id="thin_arrow_small-9" data-name="thin arrow small" class="cls-3" d="M186,656h1v1h-1v-1Zm0,0h1v1h-1v-1Zm-1-1h1v1h-1v-1Zm-1-1h1v1h-1v-1Zm-1-1h1v1h-1v-1Zm-1-1h1v1h-1v-1Zm-1,1h1v1h-1v-1Zm-1,1h1v1h-1v-1Zm-1,1h1v1h-1v-1Zm-1,1h1v1h-1v-1Z"/>
    <path id="thin_tail_arrow_small-5" data-name="thin tail arrow small" class="cls-3" d="M266,437h1v1h-1v-1Zm0,0h1v1h-1v-1Zm-1-1h1v1h-1v-1Zm-1-1h1v1h-1v-1Zm-1-1h1v1h-1v-1Zm-1-1h1v1h-1v-1Zm-1,1h1v1h-1v-1Zm-1,1h1v1h-1v-1Zm-1,1h1v1h-1v-1Zm-1,1h1v1h-1v-1Zm4-3h1v10h-1V434Z"/>
    <path id="thin_tail_arrow_small-6" data-name="thin tail arrow small" class="cls-3" d="M262,515h1v1h-1v-1Zm0,0h1v1h-1v-1Zm-1,1h1v1h-1v-1Zm-1,1h1v1h-1v-1Zm-1,1h1v1h-1v-1Zm-1,1h1v1h-1v-1Zm1,1h1v1h-1v-1Zm1,1h1v1h-1v-1Zm1,1h1v1h-1v-1Zm1,1h1v1h-1v-1Zm-4-4h10v1H258v-1Z"/>
    <path id="thin_tail_arrow_small-7" data-name="thin tail arrow small" class="cls-3" d="M263,554h1v1h-1v-1Zm0,0h1v1h-1v-1Zm1,1h1v1h-1v-1Zm1,1h1v1h-1v-1Zm1,1h1v1h-1v-1Zm1,1h1v1h-1v-1Zm-1,1h1v1h-1v-1Zm-1,1h1v1h-1v-1Zm-1,1h1v1h-1v-1Zm-1,1h1v1h-1v-1Zm-5-4h10v1H258v-1Z"/>
    <path id="thin_tail_arrow_small-8" data-name="thin tail arrow small" class="cls-3" d="M258,480h1v1h-1v-1Zm0,0h1v1h-1v-1Zm1,1h1v1h-1v-1Zm1,1h1v1h-1v-1Zm1,1h1v1h-1v-1Zm1,1h1v1h-1v-1Zm1-1h1v1h-1v-1Zm1-1h1v1h-1v-1Zm1-1h1v1h-1v-1Zm1-1h1v1h-1v-1Zm-4-6h1v10h-1V474Z"/>
    <path id="thin_tail_arrow_medium-5" data-name="thin tail arrow medium" class="cls-3" d="M267,283h1v21h-1V283Zm-8,13h1v1h-1v-1Zm1,1h1v1h-1v-1Zm1,1h1v1h-1v-1Zm1,1h1v1h-1v-1Zm1,1h1v1h-1v-1Zm1,1h1v1h-1v-1Zm1,1h1v1h-1v-1Zm1,1h1v1h-1v-1Zm1,1h1v1h-1v-1Zm1-1h1v1h-1v-1Zm1-1h1v1h-1v-1Zm1-1h1v1h-1v-1Zm1-1h1v1h-1v-1Zm1-1h1v1h-1v-1Zm1-1h1v1h-1v-1Zm1-1h1v1h-1v-1Zm1-1h1v1h-1v-1Zm-17-1h1v1h-1v-1Zm18,0h1v1h-1v-1Z"/>
    <path id="thin_tail_arrow_medium-6" data-name="thin tail arrow medium" class="cls-3" d="M267,232h1v21h-1V232Zm-8,7h1v1h-1v-1Zm1-1h1v1h-1v-1Zm1-1h1v1h-1v-1Zm1-1h1v1h-1v-1Zm1-1h1v1h-1v-1Zm1-1h1v1h-1v-1Zm1-1h1v1h-1v-1Zm1-1h1v1h-1v-1Zm1-1h1v1h-1v-1Zm1,1h1v1h-1v-1Zm1,1h1v1h-1v-1Zm1,1h1v1h-1v-1Zm1,1h1v1h-1v-1Zm1,1h1v1h-1v-1Zm1,1h1v1h-1v-1Zm1,1h1v1h-1v-1Zm1,1h1v1h-1v-1Zm-17,1h1v1h-1v-1Zm18,0h1v1h-1v-1Z"/>
    <path id="thin_tail_arrow_medium-7" data-name="thin tail arrow medium" class="cls-3" d="M258,393h21v1H258v-1Zm13,8h1v1h-1v-1Zm1-1h1v1h-1v-1Zm1-1h1v1h-1v-1Zm1-1h1v1h-1v-1Zm1-1h1v1h-1v-1Zm1-1h1v1h-1v-1Zm1-1h1v1h-1v-1Zm1-1h1v1h-1v-1Zm1-1h1v1h-1v-1Zm-1-1h1v1h-1v-1Zm-1-1h1v1h-1v-1Zm-1-1h1v1h-1v-1Zm-1-1h1v1h-1v-1Zm-1-1h1v1h-1v-1Zm-1-1h1v1h-1v-1Zm-1-1h1v1h-1v-1Zm-1-1h1v1h-1v-1Zm-1,17h1v1h-1v-1Zm0-18h1v1h-1v-1Z"/>
    <path id="thin_tail_arrow_medium-8" data-name="thin tail arrow medium" class="cls-3" d="M259,344h21v1H259v-1Zm7,8h1v1h-1v-1Zm-1-1h1v1h-1v-1Zm-1-1h1v1h-1v-1Zm-1-1h1v1h-1v-1Zm-1-1h1v1h-1v-1Zm-1-1h1v1h-1v-1Zm-1-1h1v1h-1v-1Zm-1-1h1v1h-1v-1Zm-1-1h1v1h-1v-1Zm1-1h1v1h-1v-1Zm1-1h1v1h-1v-1Zm1-1h1v1h-1v-1Zm1-1h1v1h-1v-1Zm1-1h1v1h-1v-1Zm1-1h1v1h-1v-1Zm1-1h1v1h-1v-1Zm1-1h1v1h-1v-1Zm1,17h1v1h-1v-1Zm0-18h1v1h-1v-1Z"/>
    <path id="thin_tail_arrow_large-5" data-name="thin tail arrow large" class="cls-3" d="M271,64h1V85h-1V64Zm-8,13h1v1h-1V77Zm1,1h1v1h-1V78Zm1,1h1v1h-1V79Zm1,1h1v1h-1V80Zm1,1h1v1h-1V81Zm1,1h1v1h-1V82Zm1,1h1v1h-1V83Zm1,1h1v1h-1V84Zm1,1h1v1h-1V85Zm1-1h1v1h-1V84Zm1-1h1v1h-1V83Zm1-1h1v1h-1V82Zm1-1h1v1h-1V81Zm1-1h1v1h-1V80Zm1-1h1v1h-1V79Zm1-1h1v1h-1V78Zm1-1h1v1h-1V77Zm-17-1h1v1h-1V76Zm18,0h1v1h-1V76Zm1-1h1v1h-1V75Zm1-1h1v1h-1V74Zm1-1h1v1h-1V73Zm1-1h1v1h-1V72Zm-23,3h1v1h-1V75Zm-1-1h1v1h-1V74Zm-1-1h1v1h-1V73Zm-1-1h1v1h-1V72Zm13-9h1V84h-1V63Zm0-1h1V83h-1V62Zm0-1h1V82h-1V61Zm0-1h1V81h-1V60Zm0-1h1V80h-1V59Zm0-1h1V79h-1V58Z"/>
    <path id="thin_tail_arrow_large-6" data-name="thin tail arrow large" class="cls-3" d="M271,1h1V22h-1V1Zm-8,7h1V9h-1V8Zm1-1h1V8h-1V7Zm1-1h1V7h-1V6Zm1-1h1V6h-1V5Zm1-1h1V5h-1V4Zm1-1h1V4h-1V3Zm1-1h1V3h-1V2Zm1-1h1V2h-1V1Zm1-1h1V1h-1V0Zm1,1h1V2h-1V1Zm1,1h1V3h-1V2Zm1,1h1V4h-1V3Zm1,1h1V5h-1V4Zm1,1h1V6h-1V5Zm1,1h1V7h-1V6Zm1,1h1V8h-1V7Zm1,1h1V9h-1V8ZM262,9h1v1h-1V9Zm18,0h1v1h-1V9Zm1,1h1v1h-1V10Zm1,1h1v1h-1V11Zm1,1h1v1h-1V12Zm1,1h1v1h-1V13Zm-23-3h1v1h-1V10Zm-1,1h1v1h-1V11Zm-1,1h1v1h-1V12Zm-1,1h1v1h-1V13ZM271,2h1V23h-1V2Zm0,1h1V24h-1V3Zm0,1h1V25h-1V4Zm0,1h1V26h-1V5Zm0,1h1V27h-1V6Zm0,1h1V28h-1V7Z"/>
    <path id="thin_tail_arrow_large-7" data-name="thin tail arrow large" class="cls-3" d="M264,186h21v1H264v-1Zm13,8h1v1h-1v-1Zm1-1h1v1h-1v-1Zm1-1h1v1h-1v-1Zm1-1h1v1h-1v-1Zm1-1h1v1h-1v-1Zm1-1h1v1h-1v-1Zm1-1h1v1h-1v-1Zm1-1h1v1h-1v-1Zm1-1h1v1h-1v-1Zm-1-1h1v1h-1v-1Zm-1-1h1v1h-1v-1Zm-1-1h1v1h-1v-1Zm-1-1h1v1h-1v-1Zm-1-1h1v1h-1v-1Zm-1-1h1v1h-1v-1Zm-1-1h1v1h-1v-1Zm-1-1h1v1h-1v-1Zm-1,17h1v1h-1v-1Zm0-18h1v1h-1v-1Zm-1-1h1v1h-1v-1Zm-1-1h1v1h-1v-1Zm-1-1h1v1h-1v-1Zm-1-1h1v1h-1v-1Zm3,23h1v1h-1v-1Zm-1,1h1v1h-1v-1Zm-1,1h1v1h-1v-1Zm-1,1h1v1h-1v-1Zm-9-13h21v1H263v-1Zm-1,0h21v1H262v-1Zm-1,0h21v1H261v-1Zm-1,0h21v1H260v-1Zm-1,0h21v1H259v-1Zm-1,0h21v1H258v-1Z"/>
    <path id="thin_tail_arrow_large-8" data-name="thin tail arrow large" class="cls-3" d="M259,129h21v1H259v-1Zm7,8h1v1h-1v-1Zm-1-1h1v1h-1v-1Zm-1-1h1v1h-1v-1Zm-1-1h1v1h-1v-1Zm-1-1h1v1h-1v-1Zm-1-1h1v1h-1v-1Zm-1-1h1v1h-1v-1Zm-1-1h1v1h-1v-1Zm-1-1h1v1h-1v-1Zm1-1h1v1h-1v-1Zm1-1h1v1h-1v-1Zm1-1h1v1h-1v-1Zm1-1h1v1h-1v-1Zm1-1h1v1h-1v-1Zm1-1h1v1h-1v-1Zm1-1h1v1h-1v-1Zm1-1h1v1h-1v-1Zm1,17h1v1h-1v-1Zm0-18h1v1h-1v-1Zm1-1h1v1h-1v-1Zm1-1h1v1h-1v-1Zm1-1h1v1h-1v-1Zm1-1h1v1h-1v-1Zm-3,23h1v1h-1v-1Zm1,1h1v1h-1v-1Zm1,1h1v1h-1v-1Zm1,1h1v1h-1v-1Zm-11-13h21v1H260v-1Zm1,0h21v1H261v-1Zm1,0h21v1H262v-1Zm1,0h21v1H263v-1Zm1,0h21v1H264v-1Zm1,0h21v1H265v-1Z"/>
    <path id="thin_arrow_medium-5" data-name="thin arrow medium" class="cls-3" d="M192,491h1v1h-1v-1Zm-1-1h1v1h-1v-1Zm-1-1h1v1h-1v-1Zm-1-1h1v1h-1v-1Zm-1-1h1v1h-1v-1Zm-1-1h1v1h-1v-1Zm-1-1h1v1h-1v-1Zm-1-1h1v1h-1v-1Zm-1,1h1v1h-1v-1Zm-1,1h1v1h-1v-1Zm-1,1h1v1h-1v-1Zm-1,1h1v1h-1v-1Zm-1,1h1v1h-1v-1Zm-1,1h1v1h-1v-1Zm-1,1h1v1h-1v-1Z"/>
    <path id="thin_arrow_medium-6" data-name="thin arrow medium" class="cls-3" d="M185,560h1v1h-1v-1Zm-1,1h1v1h-1v-1Zm-1,1h1v1h-1v-1Zm-1,1h1v1h-1v-1Zm-1,1h1v1h-1v-1Zm-1,1h1v1h-1v-1Zm-1,1h1v1h-1v-1Zm-1,1h1v1h-1v-1Zm1,1h1v1h-1v-1Zm1,1h1v1h-1v-1Zm1,1h1v1h-1v-1Zm1,1h1v1h-1v-1Zm1,1h1v1h-1v-1Zm1,1h1v1h-1v-1Zm1,1h1v1h-1v-1Z"/>
    <path id="thin_arrow_medium-7" data-name="thin arrow medium" class="cls-3" d="M178,607h1v1h-1v-1Zm1,1h1v1h-1v-1Zm1,1h1v1h-1v-1Zm1,1h1v1h-1v-1Zm1,1h1v1h-1v-1Zm1,1h1v1h-1v-1Zm1,1h1v1h-1v-1Zm1,1h1v1h-1v-1Zm-1,1h1v1h-1v-1Zm-1,1h1v1h-1v-1Zm-1,1h1v1h-1v-1Zm-1,1h1v1h-1v-1Zm-1,1h1v1h-1v-1Zm-1,1h1v1h-1v-1Zm-1,1h1v1h-1v-1Z"/>
    <path id="thin_arrow_medium-8" data-name="thin arrow medium" class="cls-3" d="M192,522h1v1h-1v-1Zm-1,1h1v1h-1v-1Zm-1,1h1v1h-1v-1Zm-1,1h1v1h-1v-1Zm-1,1h1v1h-1v-1Zm-1,1h1v1h-1v-1Zm-1,1h1v1h-1v-1Zm-1,1h1v1h-1v-1Zm-1-1h1v1h-1v-1Zm-1-1h1v1h-1v-1Zm-1-1h1v1h-1v-1Zm-1-1h1v1h-1v-1Zm-1-1h1v1h-1v-1Zm-1-1h1v1h-1v-1Zm-1-1h1v1h-1v-1Z"/>
    <path id="thin_arrow_large-5" data-name="thin arrow large" class="cls-3" d="M199,290h1v1h-1v-1Zm-1-1h1v1h-1v-1Zm-1-1h1v1h-1v-1Zm-1-1h1v1h-1v-1Zm-1-1h1v1h-1v-1Zm-1-1h1v1h-1v-1Zm-1-1h1v1h-1v-1Zm-1-1h1v1h-1v-1Zm-1-1h1v1h-1v-1Zm-1,1h1v1h-1v-1Zm-1,1h1v1h-1v-1Zm-1,1h1v1h-1v-1Zm-1,1h1v1h-1v-1Zm-1,1h1v1h-1v-1Zm-1,1h1v1h-1v-1Zm-1,1h1v1h-1v-1Zm-1,1h1v1h-1v-1Zm17,1h1v1h-1v-1Zm-18,0h1v1h-1v-1Zm19,1h1v1h-1v-1Zm1,1h1v1h-1v-1Zm1,1h1v1h-1v-1Zm1,1h1v1h-1v-1Zm-23-3h1v1h-1v-1Zm-1,1h1v1h-1v-1Zm-1,1h1v1h-1v-1Zm-1,1h1v1h-1v-1Z"/>
    <path id="thin_arrow_large-6" data-name="thin arrow large" class="cls-3" d="M186,375h1v1h-1v-1Zm-1,1h1v1h-1v-1Zm-1,1h1v1h-1v-1Zm-1,1h1v1h-1v-1Zm-1,1h1v1h-1v-1Zm-1,1h1v1h-1v-1Zm-1,1h1v1h-1v-1Zm-1,1h1v1h-1v-1Zm-1,1h1v1h-1v-1Zm1,1h1v1h-1v-1Zm1,1h1v1h-1v-1Zm1,1h1v1h-1v-1Zm1,1h1v1h-1v-1Zm1,1h1v1h-1v-1Zm1,1h1v1h-1v-1Zm1,1h1v1h-1v-1Zm1,1h1v1h-1v-1Zm1-17h1v1h-1v-1Zm0,18h1v1h-1v-1Zm1-19h1v1h-1v-1Zm1-1h1v1h-1v-1Zm1-1h1v1h-1v-1Zm1-1h1v1h-1v-1Zm-3,23h1v1h-1v-1Zm1,1h1v1h-1v-1Zm1,1h1v1h-1v-1Zm1,1h1v1h-1v-1Z"/>
    <path id="thin_arrow_large-7" data-name="thin arrow large" class="cls-3" d="M183,432h1v1h-1v-1Zm1,1h1v1h-1v-1Zm1,1h1v1h-1v-1Zm1,1h1v1h-1v-1Zm1,1h1v1h-1v-1Zm1,1h1v1h-1v-1Zm1,1h1v1h-1v-1Zm1,1h1v1h-1v-1Zm1,1h1v1h-1v-1Zm-1,1h1v1h-1v-1Zm-1,1h1v1h-1v-1Zm-1,1h1v1h-1v-1Zm-1,1h1v1h-1v-1Zm-1,1h1v1h-1v-1Zm-1,1h1v1h-1v-1Zm-1,1h1v1h-1v-1Zm-1,1h1v1h-1v-1Zm-1-17h1v1h-1v-1Zm0,18h1v1h-1v-1Zm-1-19h1v1h-1v-1Zm-1-1h1v1h-1v-1Zm-1-1h1v1h-1v-1Zm-1-1h1v1h-1v-1Zm3,23h1v1h-1v-1Zm-1,1h1v1h-1v-1Zm-1,1h1v1h-1v-1Zm-1,1h1v1h-1v-1Z"/>
    <path id="thin_arrow_large-8" data-name="thin arrow large" class="cls-3" d="M199,331h1v1h-1v-1Zm-1,1h1v1h-1v-1Zm-1,1h1v1h-1v-1Zm-1,1h1v1h-1v-1Zm-1,1h1v1h-1v-1Zm-1,1h1v1h-1v-1Zm-1,1h1v1h-1v-1Zm-1,1h1v1h-1v-1Zm-1,1h1v1h-1v-1Zm-1-1h1v1h-1v-1Zm-1-1h1v1h-1v-1Zm-1-1h1v1h-1v-1Zm-1-1h1v1h-1v-1Zm-1-1h1v1h-1v-1Zm-1-1h1v1h-1v-1Zm-1-1h1v1h-1v-1Zm-1-1h1v1h-1v-1Zm17-1h1v1h-1v-1Zm-18,0h1v1h-1v-1Zm19-1h1v1h-1v-1Zm1-1h1v1h-1v-1Zm1-1h1v1h-1v-1Zm1-1h1v1h-1v-1Zm-23,3h1v1h-1v-1Zm-1-1h1v1h-1v-1Zm-1-1h1v1h-1v-1Zm-1-1h1v1h-1v-1Z"/>
    <path id="fat_arrow-5" data-name="fat arrow" class="cls-3" d="M228,25V24h-1V23h-1V22h-1V21h-1V20h-1V19h-1V18h-1V17h-1V16h-1V15h-1V14h-1V13h-1V12h-1V11h-1V10h-1V9h-1V8h-1V7h-1V6h-1V5h-1V4h-1V3h-1V2h-1V1h-1V0h-1V1h-1V2h-1V3h-1V4h-1V5h-1V6h-1V7h-1V8h-1V9h-1v1h-1v1h-1v1h-1v1h-1v1h-1v1h-1v1h-1v1h-1v1h-1v1h-1v1h-1v1h-1v1h-1v1h-1v1h-1v1h-1v1h1v1h1v1h1v1h1v1h1V29h1V28h1V27h1V26h1V25h1V24h1V23h1V22h1V21h1V20h1V19h1V18h1V17h1V16h1V15h1V14h1V13h1V12h1V11h1V10h1V9h1v1h1v1h1v1h1v1h1v1h1v1h1v1h1v1h1v1h1v1h1v1h1v1h1v1h1v1h1v1h1v1h1v1h1v1h1v1h1v1h1v1h1V29h1V28h1V27h1V26h1V25h-1Z"/>
    <path id="fat_arrow-6" data-name="fat arrow" class="cls-3" d="M183,251h1v-1h1v-1h1v-1h1v-1h1v-1h1v-1h1v-1h1v-1h1v-1h1v-1h1v-1h1v-1h1v-1h1v-1h1v-1h1v-1h1v-1h1v-1h1v-1h1v-1h1v-1h1v-1h1v-1h1v-1h1v-1h-1v-1h-1v-1h-1v-1h-1v-1h-1v-1h-1v-1h-1v-1h-1v-1h-1v-1h-1v-1h-1v-1h-1v-1h-1v-1h-1v-1h-1v-1h-1v-1h-1v-1h-1v-1h-1v-1h-1v-1h-1v-1h-1v-1h-1v-1h-1v-1h-1v-1h-1v1h-1v1h-1v1h-1v1h-1v1h1v1h1v1h1v1h1v1h1v1h1v1h1v1h1v1h1v1h1v1h1v1h1v1h1v1h1v1h1v1h1v1h1v1h1v1h1v1h1v1h1v1h-1v1h-1v1h-1v1h-1v1h-1v1h-1v1h-1v1h-1v1h-1v1h-1v1h-1v1h-1v1h-1v1h-1v1h-1v1h-1v1h-1v1h-1v1h-1v1h-1v1h-1v1h1v1h1v1h1v1h1v1h1v-1Z"/>
    <path id="fat_arrow-7" data-name="fat arrow" class="cls-3" d="M203,170h-1v-1h-1v-1h-1v-1h-1v-1h-1v-1h-1v-1h-1v-1h-1v-1h-1v-1h-1v-1h-1v-1h-1v-1h-1v-1h-1v-1h-1v-1h-1v-1h-1v-1h-1v-1h-1v-1h-1v-1h-1v-1h-1v-1h-1v-1h-1v-1h-1v-1h1v-1h1v-1h1v-1h1v-1h1v-1h1v-1h1v-1h1v-1h1v-1h1v-1h1v-1h1v-1h1v-1h1v-1h1v-1h1v-1h1v-1h1v-1h1v-1h1v-1h1v-1h1v-1h1v-1h1v-1h1v-1h1v1h1v1h1v1h1v1h1v1h-1v1h-1v1h-1v1h-1v1h-1v1h-1v1h-1v1h-1v1h-1v1h-1v1h-1v1h-1v1h-1v1h-1v1h-1v1h-1v1h-1v1h-1v1h-1v1h-1v1h-1v1h1v1h1v1h1v1h1v1h1v1h1v1h1v1h1v1h1v1h1v1h1v1h1v1h1v1h1v1h1v1h1v1h1v1h1v1h1v1h1v1h1v1h-1v1h-1v1h-1v1h-1v1h-1v-1Z"/>
    <path id="fat_arrow-8" data-name="fat arrow" class="cls-3" d="M228,65v1h-1v1h-1v1h-1v1h-1v1h-1v1h-1v1h-1v1h-1v1h-1v1h-1v1h-1v1h-1v1h-1v1h-1v1h-1v1h-1v1h-1v1h-1v1h-1v1h-1v1h-1v1h-1v1h-1v1h-1v1h-1V89h-1V88h-1V87h-1V86h-1V85h-1V84h-1V83h-1V82h-1V81h-1V80h-1V79h-1V78h-1V77h-1V76h-1V75h-1V74h-1V73h-1V72h-1V71h-1V70h-1V69h-1V68h-1V67h-1V66h-1V65h-1V64h1V63h1V62h1V61h1V60h1v1h1v1h1v1h1v1h1v1h1v1h1v1h1v1h1v1h1v1h1v1h1v1h1v1h1v1h1v1h1v1h1v1h1v1h1v1h1v1h1v1h1V80h1V79h1V78h1V77h1V76h1V75h1V74h1V73h1V72h1V71h1V70h1V69h1V68h1V67h1V66h1V65h1V64h1V63h1V62h1V61h1V60h1v1h1v1h1v1h1v1h1v1h-1Z"/>
    <path id="fat_plus_copy" data-name="fat plus copy" class="cls-3" d="M229,1051H207v22h-7v-22H178v-7h22v-22h7v22h22v7Z"/>
    <path id="plus_large_copy" data-name="plus large copy" class="cls-3" d="M205,1117H192v13h-1v-13H178v-1h13v-13h1v13h13v1Z"/>
    <path id="plus_medium_copy" data-name="plus medium copy" class="cls-3" d="M193,1168h-7v7h-1v-7h-7v-1h7v-7h1v7h7v1Z"/>
    <path id="plus_small_copy" data-name="plus small copy" class="cls-3" d="M187,1210h-4v4h-1v-4h-4v-1h4v-4h1v4h4v1Z"/>
  </g>
</svg>
