<?xml version="1.0" standalone="no"?>
<!DOCTYPE svg PUBLIC "-//W3C//DTD SVG 1.1//EN"
"http://www.w3.org/Graphics/SVG/1.1/DTD/svg11.dtd">

<svg width="376" height="112" view_box="0 0 376 112"
xmlns="http://www.w3.org/2000/svg"
xmlns:link="http://www.w3.org/1999/xlink">\n\n<desc>Généré par Mocodo 2.3.7 le Wed, 15 Feb 2017 09:55:19</desc>

<rect id="frame" x="0" y="0" width="376" height="112" fill="none" stroke="none" stroke-width="0"/>

<!-- Association bloque -->
<line x1="74" y1="56" x2="208" y2="56" stroke="#726f83" stroke-width="1"/>
<text x="144" y="72.0" fill="#726f83" font-family="Futura" font-size="11">1,1</text>
<line x1="322" y1="56" x2="208" y2="56" stroke="#726f83" stroke-width="1"/>
<text x="253" y="72.0" fill="#726f83" font-family="Futura" font-size="11">0,N</text>
<g id="association-bloque">
	<path d="M 234 27 a 14 14 90 0 1 14 14 V 55 h -80 V 41 a 14 14 90 0 1 14 -14" fill="#b2bba4" stroke="#b2bba4" stroke-width="0"/>
	<path d="M 248 55.0 v 16 a 14 14 90 0 1 -14 14 H 182 a 14 14 90 0 1 -14 -14 V 55.0 H 80" fill="#ccd6ba" stroke="#ccd6ba" stroke-width="0"/>
	<rect x="168" y="27" width="80" height="58" fill="none" rx="14" stroke="#85956b" stroke-width="1.5"/>
	<line x1="168" y1="55" x2="248" y2="55" stroke="#85956b" stroke-width="1.5"/>
	<text x="175" y="48.3" fill="#27360c" font-family="Copperplate" font-size="18">bloque</text>
</g>

<!-- Entity Salle -->
<g id="entity-Salle">
	<g id="frame-Salle">
		<rect x="277" y="9" width="90" height="30" fill="#97b8ff" stroke="#97b8ff" stroke-width="0"/>
		<rect x="277" y="39.0" width="90" height="64" fill="#c0d4ff" stroke="#c0d4ff" stroke-width="0"/>
		<rect x="277" y="9" width="90" height="94" fill="none" stroke="#578dff" stroke-width="1.5"/>
		<line x1="277" y1="39" x2="367" y2="39" stroke="#578dff" stroke-width="1.5"/>
	</g>
	<text x="295" y="30.3" fill="#131114" font-family="Copperplate" font-size="18">Salle</text>
	<text x="285" y="56.1" fill="#3e3c42" font-family="Gill Sans" font-size="15">libelle</text>
	<line x1="285" y1="59" x2="322" y2="59" stroke="#3e3c42" stroke-width="1"/>
	<text x="285" y="73.1" fill="#3e3c42" font-family="Gill Sans" font-size="15">heuredebut</text>
	<text x="285" y="90.0" fill="#3e3c42" font-family="Gill Sans" font-size="15">heurefin</text>
</g>

<!-- Entity Reservation -->
<g id="entity-Reservation">
	<g id="frame-Reservation">
		<rect x="9" y="9" width="130" height="30" fill="#97b8ff" stroke="#97b8ff" stroke-width="0"/>
		<rect x="9" y="39.0" width="130" height="64" fill="#c0d4ff" stroke="#c0d4ff" stroke-width="0"/>
		<rect x="9" y="9" width="130" height="94" fill="none" stroke="#578dff" stroke-width="1.5"/>
		<line x1="9" y1="39" x2="139" y2="39" stroke="#578dff" stroke-width="1.5"/>
	</g>
	<text x="17" y="30.3" fill="#131114" font-family="Copperplate" font-size="18">Reservation</text>
	<text x="17" y="56.1" fill="#3e3c42" font-family="Gill Sans" font-size="15">nom</text>
	<line x1="17" y1="59" x2="46" y2="59" stroke="#3e3c42" stroke-width="1"/>
	<text x="17" y="73.1" fill="#3e3c42" font-family="Gill Sans" font-size="15">datedebut</text>
	<text x="17" y="90.0" fill="#3e3c42" font-family="Gill Sans" font-size="15">datefin</text>
</g>
</svg>