"Lorem" ; "ipsum" ; "dolor" ; "sit" ; "amet" ; "consectetur" ; "adipiscing" ; "elit." ; "Cras" ; "sed" ; "mauris" ; "eget" ; "erat" ; "scelerisque" ; "semper." ; "Integer" ; "fermentum" ; "justo" ; "ut" ; "felis" ; "consectetur" ; "sodales." ; "Cras" ; "feugiat" ; "sit" ; "amet" ; "arcu" ; "ut" ; "efficitur." ; "Sed" ; "odio" ; "ex" ; "congue" ; "eget" ; "sapien" ; "quis" ; "imperdiet" ; "ultricies" ; "massa." ; "Nulla" ; "non" ; "euismod" ; "erat." ; "Morbi" ; "auctor" ; "interdum" ; "magna" ; "eu" ; "malesuada" ; "lectus." ; "Vivamus" ; "eu" ; "justo" ; "finibus" ; "leo" ; "auctor" ; "mollis." ; "Suspendisse" ; "mollis" ; "dui" ; "augue" ; "eu" ; "lobortis" ; "ligula" ; "venenatis" ; "id." ; "Integer" ; "dapibus" ; "luctus" ; "sem.
Phasellus" ; "tortor" ; "lacus" ; "condimentum" ; "pretium" ; "auctor" ; "at" ; "cursus" ; "sed" ; "nibh." ; "Quisque" ; "mollis" ; "venenatis" ; "nisi" ; "consectetur" ; "convallis." ; "Quisque" ; "sollicitudin" ; "dolor" ; "id" ; "nisi" ; "auctor" ; "quis" ; "pharetra" ; "dolor" ; "convallis." ; "Nulla" ; "libero" ; "nisl" ; "ornare" ; "id" ; "faucibus" ; "eget" ; "ultrices" ; "sit" ; "amet" ; "tellus." ; "Vivamus" ; "interdum" ; "arcu" ; "ut" ; "nulla" ; "efficitur" ; "hendrerit" ; "sollicitudin" ; "at" ; "augue." ; "Praesent" ; "convallis" ; "cursus" ; "sem" ; "non" ; "venenatis" ; "nisi" ; "dictum" ; "eget." ; "Etiam" ; "blandit" ; "aliquam" ; "feugiat." ; "Pellentesque" ; "lobortis" ; "libero" ; "quis" ; "quam" ; "pulvinar" ; "ullamcorper." ; "Vestibulum" ; "fringilla" ; "venenatis" ; "posuere." ; "Vivamus" ; "at" ; "blandit" ; "neque." ; "Maecenas" ; "nunc" ; "nunc" ; "lobortis" ; "non" ; "cursus" ; "at" ; "tincidunt" ; "vel" ; "nunc." ; "Donec" ; "vestibulum" ; "porta" ; "sapien" ; "sed" ; "luctus." ; "Donec" ; "vulputate" ; "dui" ; "non" ; "mi" ; "condimentum" ; "lacinia." ; "Proin" ; "sem" ; "quam" ; "scelerisque" ; "eget" ; "vulputate" ; "ut" ; "dictum" ; "non" ; "elit." ; "Sed" ; "ullamcorper" ; "non" ; "nunc" ; "at" ; "varius.
Phasellus" ; "placerat" ; "aliquet" ; "leo" ; "a" ; "volutpat" ; "lectus" ; "fringilla" ; "in." ; "Mauris" ; "luctus" ; "nisl" ; "nec" ; "blandit" ; "blandit." ; "Morbi" ; "egestas" ; "magna" ; "interdum" ; "lacinia" ; "augue" ; "eget" ; "laoreet" ; "leo." ; "Etiam" ; "tincidunt" ; "velit" ; "sed" ; "lobortis" ; "ullamcorper" ; "enim" ; "arcu" ; "dictum" ; "lacus" ; "ut" ; "fermentum" ; "ipsum" ; "metus" ; "sagittis" ; "velit." ; "Nullam" ; "finibus" ; "urna" ; "ut" ; "nisl" ; "venenatis" ; "congue." ; "Nulla" ; "fringilla" ; "id" ; "quam" ; "in" ; "porta." ; "Maecenas" ; "eros" ; "sem" ; "fringilla" ; "non" ; "iaculis" ; "vel" ; "tempus" ; "vitae" ; "orci." ; "Etiam" ; "nisl" ; "massa" ; "rhoncus" ; "sit" ; "amet" ; "erat" ; "quis" ; "vulputate" ; "ornare" ; "quam." ; "Duis" ; "auctor" ; "tellus" ; "bibendum" ; "erat" ; "ultrices" ; "suscipit.
Morbi" ; "a" ; "viverra" ; "lorem." ; "Suspendisse" ; "sollicitudin" ; "condimentum" ; "pharetra." ; "Maecenas" ; "eu" ; "enim" ; "nec" ; "neque" ; "fringilla" ; "vehicula." ; "Etiam" ; "sed" ; "nisi" ; "eget" ; "diam" ; "lacinia" ; "volutpat." ; "Morbi" ; "augue" ; "felis" ; "tempor" ; "et" ; "sem" ; "eu" ; "tincidunt" ; "efficitur" ; "ex." ; "Curabitur" ; "eleifend" ; "enim" ; "vel" ; "ullamcorper" ; "interdum" ; "orci" ; "enim" ; "suscipit" ; "massa" ; "ut" ; "ullamcorper" ; "diam" ; "metus" ; "et" ; "sem." ; "Donec" ; "sollicitudin" ; "sagittis" ; "turpis" ; "eget" ; "luctus" ; "eros" ; "imperdiet" ; "sit" ; "amet." ; "Aenean" ; "id" ; "
Donec" ; "imperdiet" ; "arcu" ; "id" ; "feugiat" ; "posuere" ; "odio" ; "eros" ; "pretium" ; "diam" ; "in" ; "convallis" ; "felis" ; "ex" ; "congue" ; "sem." ; "Suspendisse" ; "in" ; "mi" ; "sagittis" ; "tortor" ; "vehicula" ; "molestie." ; "Donec" ; "convallis" ; "enim" ; "sed" ; "erat" ; "egestas" ; "ac" ; "eleifend" ; "nisi" ; "dictum." ; "Nulla" ; "id" ; "sodales" ; "est." ; "Ut" ; "consectetur" ; "iaculis" ; "tortor." ; "Cras" ; "consequat" ; "vel" ; "quam" ; "vitae" ; "facilisis." ; "Morbi" ; "efficitur" ; "tellus" ; "at" ; "ante" ; "sagittis" ; "sed" ; "porta" ; "odio" ; "pharetra." ; "Etiam" ; "ac" ; "nibh" ; "et" ; "arcu" ; "suscipit" ; "molestie." ; "Quisque" ; "neque" ; "metus" ; "tristique" ; "nec" ; "justo" ; "nec" ; "fermentum" ; "volutpat" ; "ipsum.