<?xml version="1.0" encoding="UTF-8" standalone="no"?>
<!-- Created with Inkscape (http://www.inkscape.org/) -->

<svg
   xmlns:dc="http://purl.org/dc/elements/1.1/"
   xmlns:cc="http://creativecommons.org/ns#"
   xmlns:rdf="http://www.w3.org/1999/02/22-rdf-syntax-ns#"
   xmlns:svg="http://www.w3.org/2000/svg"
   xmlns="http://www.w3.org/2000/svg"
   xmlns:sodipodi="http://sodipodi.sourceforge.net/DTD/sodipodi-0.dtd"
   xmlns:inkscape="http://www.inkscape.org/namespaces/inkscape"
   width="210mm"
   height="297mm"
   viewBox="0 0 744.09448819 1052.3622047"
   id="svg3471"
   version="1.1"
   inkscape:version="0.91 r13725"
   sodipodi:docname="dessin JO.svg">
  <defs
     id="defs3473">
    <inkscape:path-effect
       effect="spiro"
       id="path-effect4604"
       is_visible="true" />
    <inkscape:path-effect
       effect="spiro"
       id="path-effect4600"
       is_visible="true" />
    <inkscape:path-effect
       effect="spiro"
       id="path-effect4596"
       is_visible="true" />
    <inkscape:path-effect
       effect="spiro"
       id="path-effect4592"
       is_visible="true" />
    <inkscape:path-effect
       effect="spiro"
       id="path-effect4588"
       is_visible="true" />
    <inkscape:path-effect
       effect="spiro"
       id="path-effect4584"
       is_visible="true" />
    <inkscape:path-effect
       effect="spiro"
       id="path-effect4580"
       is_visible="true" />
    <inkscape:path-effect
       effect="spiro"
       id="path-effect4501"
       is_visible="true" />
    <inkscape:path-effect
       effect="spiro"
       id="path-effect4497"
       is_visible="true" />
    <inkscape:path-effect
       effect="spiro"
       id="path-effect4493"
       is_visible="true" />
  </defs>
  <sodipodi:namedview
     id="base"
     pagecolor="#ffffff"
     bordercolor="#666666"
     borderopacity="1.0"
     inkscape:pageopacity="0.0"
     inkscape:pageshadow="2"
     inkscape:zoom="0.49497475"
     inkscape:cx="72.456859"
     inkscape:cy="565.86287"
     inkscape:document-units="px"
     inkscape:current-layer="layer1"
     showgrid="true"
     inkscape:window-width="1600"
     inkscape:window-height="837"
     inkscape:window-x="-8"
     inkscape:window-y="-8"
     inkscape:window-maximized="1">
    <inkscape:grid
       type="xygrid"
       id="grid3479" />
  </sodipodi:namedview>
  <metadata
     id="metadata3476">
    <rdf:RDF>
      <cc:Work
         rdf:about="">
        <dc:format>image/svg+xml</dc:format>
        <dc:type
           rdf:resource="http://purl.org/dc/dcmitype/StillImage" />
        <dc:title></dc:title>
      </cc:Work>
    </rdf:RDF>
  </metadata>
  <g
     inkscape:label="Calque 1"
     inkscape:groupmode="layer"
     id="layer1">
    <path
       style="fill:#ffff00"
       d="M 148.48438 217.62891 A 52.291642 49.932196 0.26503859 0 0 98.978516 265.37109 A 52.291642 49.932196 0.26503859 0 0 149.03711 317.36914 A 52.291642 49.932196 0.26503859 0 0 203.4707 269.58984 A 52.291642 49.932196 0.26503859 0 0 203.44922 267.36133 L 195.85742 267.36133 A 42.798525 44.505929 89.877905 0 1 195.85352 269.62305 A 42.798525 44.505929 89.877905 0 1 149.51172 310.58789 A 42.798525 44.505929 89.877905 0 1 106.91992 266.0332 A 42.798525 44.505929 89.877905 0 1 148.48438 225.16992 L 148.48438 217.62891 z M 163.48438 218.99219 L 163.48438 226.6875 A 42.798525 44.505929 89.877905 0 1 192.82227 252.36133 L 200.96875 252.36133 A 52.291642 49.932196 0.26503859 0 0 163.48438 218.99219 z "
       id="path4346" />
    <path
       style="fill:#000000"
       d="M 220.61133 168.97852 A 51.366496 50.072956 0 0 0 169.31641 217.10938 L 177.18555 217.10938 A 43.718017 42.919676 0 0 1 220.78516 176.47266 A 43.718017 42.919676 0 0 1 264.50391 219.39258 A 43.718017 42.919676 0 0 1 235 259.92773 L 235 267.08594 A 51.366496 50.072956 0 0 0 271.97852 219.05273 A 51.366496 50.072956 0 0 0 220.61133 168.97852 z M 172.19336 235.59375 A 51.366496 50.072956 0 0 0 220 269.11523 L 220 262.27344 A 43.718017 42.919676 0 0 1 180.33398 235.59375 L 172.19336 235.59375 z "
       id="path4346-4" />
    <path
       style="fill:#00ff00"
       d="M 275 219.35547 L 275 226.89062 A 43.395614 43.027907 0 0 1 315.39258 260.36133 L 323.00391 260.36133 A 50.98769 50.199224 0 0 0 275 219.35547 z M 261 220.73047 A 50.98769 50.199224 0 0 0 221.91992 269.48242 A 50.98769 50.199224 0 0 0 272.90625 319.68164 A 50.98769 50.199224 0 0 0 323.60352 274.36133 L 316.2207 274.36133 A 43.395614 43.027907 0 0 1 273.08008 312.85156 A 43.395614 43.027907 0 0 1 229.68359 269.82422 A 43.395614 43.027907 0 0 1 261 228.51758 L 261 220.73047 z "
       id="path4346-5" />
    <path
       style="fill:#ff0000"
       d="M 337.67773 175.93359 A 53.035919 48.928572 0 0 0 285.12891 218.71875 L 293.31836 218.71875 A 45.138863 41.938775 0 0 1 337.85742 183.25586 A 45.138863 41.938775 0 0 1 382.99805 225.19531 A 45.138863 41.938775 0 0 1 337.85742 267.13281 A 45.138863 41.938775 0 0 1 293.71484 233.71875 L 285.55859 233.71875 A 53.035919 48.928572 0 0 0 337.67773 273.78906 A 53.035919 48.928572 0 0 0 390.71484 224.86133 A 53.035919 48.928572 0 0 0 337.67773 175.93359 z "
       id="path4346-6" />
    <path
       style="fill:#000080"
       d="M 110.17773 168.43359 A 50.178787 49.107143 0 0 0 60 217.53906 A 50.178787 49.107143 0 0 0 95.802734 264.54688 L 95.802734 257.39258 A 42.707158 42.091837 0 0 1 67.640625 217.875 A 42.707158 42.091837 0 0 1 110.34766 175.7832 A 42.707158 42.091837 0 0 1 153.05664 217.875 A 42.707158 42.091837 0 0 1 110.34766 259.9668 A 42.707158 42.091837 0 0 1 110.08984 259.95312 L 110.08984 266.64258 A 50.178787 49.107143 0 0 0 110.17773 266.64648 A 50.178787 49.107143 0 0 0 160.35742 217.53906 A 50.178787 49.107143 0 0 0 110.17773 168.43359 z "
       id="path4346-9" />
  </g>
</svg>
