<?xml version="1.0" standalone="no"?>
<!DOCTYPE svg PUBLIC "-//W3C//DTD SVG 1.1//EN"
"http://www.w3.org/Graphics/SVG/1.1/DTD/svg11.dtd">

<svg width="384" height="280" view_box="0 0 384 280"
xmlns="http://www.w3.org/2000/svg"
xmlns:link="http://www.w3.org/1999/xlink">\n\n<desc>Généré par Mocodo 2.3.7 le Tue, 28 Feb 2017 13:42:45</desc>

<rect id="frame" x="0" y="0" width="384" height="280" fill="#f5f5f5" stroke="none" stroke-width="0"/>

<!-- Association envoyer -->
<line x1="71" y1="81" x2="207" y2="81" stroke="#bf812d" stroke-width="1"/>
<text x="138" y="97.0" fill="#01665e" font-family="Futura" font-size="11">0,N</text>
<line x1="328" y1="81" x2="207" y2="81" stroke="#bf812d" stroke-width="1"/>
<text x="258" y="97.0" fill="#01665e" font-family="Futura" font-size="11">1,1</text>
<line x1="207" y1="224" x2="207" y2="81" stroke="#bf812d" stroke-width="1"/>
<text x="212.0" y="169" fill="#01665e" font-family="Futura" font-size="11">1,N</text>
<g id="association-envoyer">
	<path d="M 238 52 a 14 14 90 0 1 14 14 V 80 h -90 V 66 a 14 14 90 0 1 14 -14" fill="#dfc27d" stroke="#dfc27d" stroke-width="0"/>
	<path d="M 252 80.0 v 16 a 14 14 90 0 1 -14 14 H 176 a 14 14 90 0 1 -14 -14 V 80.0 H 90" fill="#f6e8c3" stroke="#f6e8c3" stroke-width="0"/>
	<rect x="162" y="52" width="90" height="58" fill="none" rx="14" stroke="#bf812d" stroke-width="1.5"/>
	<line x1="162" y1="80" x2="252" y2="80" stroke="#bf812d" stroke-width="1.5"/>
	<text x="169" y="73.3" fill="#000000" font-family="Copperplate" font-size="18">envoyer</text>
</g>

<!-- Entity Discussion -->
<g id="entity-Discussion">
	<g id="frame-Discussion">
		<rect x="148" y="177" width="118" height="30" fill="#80cdc1" stroke="#80cdc1" stroke-width="0"/>
		<rect x="148" y="207.0" width="118" height="64" fill="#c7eae5" stroke="#c7eae5" stroke-width="0"/>
		<rect x="148" y="177" width="118" height="94" fill="none" stroke="#35978f" stroke-width="1.5"/>
		<line x1="148" y1="207" x2="266" y2="207" stroke="#35978f" stroke-width="1.5"/>
	</g>
	<text x="156" y="198.3" fill="#000000" font-family="Copperplate" font-size="18">Discussion</text>
	<text x="156" y="224.1" fill="#000000" font-family="Gill Sans" font-size="15">id</text>
	<line x1="156" y1="227" x2="168" y2="227" stroke="#000000" stroke-width="1"/>
	<text x="156" y="241.1" fill="#000000" font-family="Gill Sans" font-size="15">intitulé</text>
	<text x="156" y="258.0" fill="#000000" font-family="Gill Sans" font-size="15">confidentialité</text>
</g>

<!-- Entity Utilisateur -->
<g id="entity-Utilisateur">
	<g id="frame-Utilisateur">
		<rect x="9" y="9" width="124" height="30" fill="#80cdc1" stroke="#80cdc1" stroke-width="0"/>
		<rect x="9" y="39.0" width="124" height="114" fill="#c7eae5" stroke="#c7eae5" stroke-width="0"/>
		<rect x="9" y="9" width="124" height="144" fill="none" stroke="#35978f" stroke-width="1.5"/>
		<line x1="9" y1="39" x2="133" y2="39" stroke="#35978f" stroke-width="1.5"/>
	</g>
	<text x="17" y="30.3" fill="#000000" font-family="Copperplate" font-size="18">Utilisateur</text>
	<text x="17" y="56.1" fill="#000000" font-family="Gill Sans" font-size="15">id</text>
	<line x1="17" y1="59" x2="29" y2="59" stroke="#000000" stroke-width="1"/>
	<text x="17" y="73.1" fill="#000000" font-family="Gill Sans" font-size="15">nom</text>
	<text x="17" y="90.1" fill="#000000" font-family="Gill Sans" font-size="15">prenom</text>
	<text x="17" y="107.1" fill="#000000" font-family="Gill Sans" font-size="15">pseudo</text>
	<text x="17" y="124.0" fill="#000000" font-family="Gill Sans" font-size="15">email</text>
	<text x="17" y="141.0" fill="#000000" font-family="Gill Sans" font-size="15">mot de passe</text>
</g>

<!-- Entity Message -->
<g id="entity-Message">
	<g id="frame-Message">
		<rect x="281" y="34" width="94" height="30" fill="#80cdc1" stroke="#80cdc1" stroke-width="0"/>
		<rect x="281" y="64.0" width="94" height="64" fill="#c7eae5" stroke="#c7eae5" stroke-width="0"/>
		<rect x="281" y="34" width="94" height="94" fill="none" stroke="#35978f" stroke-width="1.5"/>
		<line x1="281" y1="64" x2="375" y2="64" stroke="#35978f" stroke-width="1.5"/>
	</g>
	<text x="289" y="55.3" fill="#000000" font-family="Copperplate" font-size="18">Message</text>
	<text x="289" y="81.1" fill="#000000" font-family="Gill Sans" font-size="15">id</text>
	<line x1="289" y1="84" x2="301" y2="84" stroke="#000000" stroke-width="1"/>
	<text x="289" y="98.1" fill="#000000" font-family="Gill Sans" font-size="15">content</text>
	<text x="289" y="115.0" fill="#000000" font-family="Gill Sans" font-size="15">date</text>
</g>
</svg>