<?xml version="1.0" standalone="no"?>
<!DOCTYPE svg PUBLIC "-//W3C//DTD SVG 1.1//EN"
"http://www.w3.org/Graphics/SVG/1.1/DTD/svg11.dtd">

<svg width="757" height="818" view_box="0 0 757 818"
xmlns="http://www.w3.org/2000/svg"
xmlns:link="http://www.w3.org/1999/xlink">\n\n<desc>Généré par Mocodo 2.3.7 le Fri, 17 Feb 2017 16:05:44</desc>

<rect id="frame" x="0" y="0" width="757" height="818" fill="#f5f5f5" stroke="none" stroke-width="0"/>

<!-- Association apprendre -->
<line x1="74" y1="156" x2="228" y2="156" stroke="#bf812d" stroke-width="1"/>
<text x="135" y="172.0" fill="#01665e" font-family="Futura" font-size="11">1,N</text>
<line x1="387" y1="156" x2="228" y2="156" stroke="#bf812d" stroke-width="1"/>
<text x="319" y="172.0" fill="#01665e" font-family="Futura" font-size="11">0,N</text>
<g id="association-apprendre">
	<path d="M 269 127 a 14 14 90 0 1 14 14 V 155 h -110 V 141 a 14 14 90 0 1 14 -14" fill="#dfc27d" stroke="#dfc27d" stroke-width="0"/>
	<path d="M 283 155.0 v 16 a 14 14 90 0 1 -14 14 H 187 a 14 14 90 0 1 -14 -14 V 155.0 H 110" fill="#f6e8c3" stroke="#f6e8c3" stroke-width="0"/>
	<rect x="173" y="127" width="110" height="58" fill="none" rx="14" stroke="#bf812d" stroke-width="1.5"/>
	<line x1="173" y1="155" x2="283" y2="155" stroke="#bf812d" stroke-width="1.5"/>
	<text x="180" y="148.3" fill="#000000" font-family="Copperplate" font-size="18">apprendre</text>
	<text x="180" y="173.1" fill="#000000" font-family="Gill Sans" font-size="15">niveau</text>
</g>

<!-- Association a pour type4 -->
<line x1="387" y1="372" x2="387" y2="489" stroke="#bf812d" stroke-width="1"/>
<text x="392.0" y="452" fill="#01665e" font-family="Futura" font-size="11">0,1</text>
<line x1="387" y1="589" x2="387" y2="489" stroke="#bf812d" stroke-width="1"/>
<text x="392.0" y="551" fill="#01665e" font-family="Futura" font-size="11">1,1</text>
<g id="association-a pour type4">
	<path d="M 433 460 a 14 14 90 0 1 14 14 V 488 h -120 V 474 a 14 14 90 0 1 14 -14" fill="#dfc27d" stroke="#dfc27d" stroke-width="0"/>
	<path d="M 447 488.0 v 16 a 14 14 90 0 1 -14 14 H 341 a 14 14 90 0 1 -14 -14 V 488.0 H 120" fill="#f6e8c3" stroke="#f6e8c3" stroke-width="0"/>
	<rect x="327" y="460" width="120" height="58" fill="none" rx="14" stroke="#bf812d" stroke-width="1.5"/>
	<line x1="327" y1="488" x2="447" y2="488" stroke="#bf812d" stroke-width="1.5"/>
	<text x="334" y="481.3" fill="#000000" font-family="Copperplate" font-size="18">a pour type</text>
</g>

<!-- Association DF5 -->
<line x1="228" y1="264" x2="74" y2="264" stroke="#bf812d" stroke-width="1"/>
<text x="159" y="280.0" fill="#01665e" font-family="Futura" font-size="11">1,1</text>
<line x1="74" y1="372" x2="74" y2="264" stroke="#bf812d" stroke-width="1"/>
<text x="79.0" y="326" fill="#01665e" font-family="Futura" font-size="11">1,N</text>
<g id="association-DF5">
	<circle cx="74" cy="264" r="20" stroke="#bf812d" stroke-width="1.5" fill="#dfc27d"/>
	<text x="61" y="268.8" fill="#000000" font-family="Copperplate" font-size="18">DF</text>
</g>

<!-- Association DF1 -->
<line x1="228" y1="56" x2="387" y2="56" stroke="#bf812d" stroke-width="1"/>
<text x="276" y="72.0" fill="#01665e" font-family="Futura" font-size="11">0,N</text>
<line x1="387" y1="156" x2="387" y2="56" stroke="#bf812d" stroke-width="1"/>
<text x="392.0" y="101" fill="#01665e" font-family="Futura" font-size="11">1,1</text>
<g id="association-DF1">
	<circle cx="387" cy="56" r="20" stroke="#bf812d" stroke-width="1.5" fill="#dfc27d"/>
	<text x="374" y="60.8" fill="#000000" font-family="Copperplate" font-size="18">DF</text>
</g>

<!-- Association DF6 -->
<line x1="387" y1="589" x2="387" y2="671" stroke="#bf812d" stroke-width="1"/>
<text x="392.0" y="635" fill="#01665e" font-family="Futura" font-size="11">1,N</text>
<line x1="387" y1="762" x2="387" y2="671" stroke="#bf812d" stroke-width="1"/>
<text x="392.0" y="707" fill="#01665e" font-family="Futura" font-size="11">1,1</text>
<g id="association-DF6">
	<circle cx="387" cy="671" r="20" stroke="#bf812d" stroke-width="1.5" fill="#dfc27d"/>
	<text x="374" y="675.8" fill="#000000" font-family="Copperplate" font-size="18">DF</text>
</g>

<!-- Association debloquer -->
<path d="M387 156 C 406.333333333 124.0 465.0 124.0 563 156" fill="none" stroke="#bf812d" stroke-width="1"/>
<text x="436" y="149.0" fill="#01665e" font-family="Futura" font-size="11">0,N</text>
<path d="M387 156 C 406.333333333 188.0 465.0 188.0 563 156" fill="none" stroke="#bf812d" stroke-width="1"/>
<text x="436" y="171.0" fill="#01665e" font-family="Futura" font-size="11">1,N</text>
<g id="association-debloquer">
	<path d="M 605 127 a 14 14 90 0 1 14 14 V 155 h -112 V 141 a 14 14 90 0 1 14 -14" fill="#dfc27d" stroke="#dfc27d" stroke-width="0"/>
	<path d="M 619 155.0 v 16 a 14 14 90 0 1 -14 14 H 521 a 14 14 90 0 1 -14 -14 V 155.0 H 112" fill="#f6e8c3" stroke="#f6e8c3" stroke-width="0"/>
	<rect x="507" y="127" width="112" height="58" fill="none" rx="14" stroke="#bf812d" stroke-width="1.5"/>
	<line x1="507" y1="155" x2="619" y2="155" stroke="#bf812d" stroke-width="1.5"/>
	<text x="514" y="148.3" fill="#000000" font-family="Copperplate" font-size="18">debloquer</text>
	<text x="514" y="173.1" fill="#000000" font-family="Gill Sans" font-size="15">niveau</text>
</g>

<!-- Association DF3 -->
<line x1="74" y1="589" x2="74" y2="671" stroke="#bf812d" stroke-width="1"/>
<text x="79.0" y="643" fill="#01665e" font-family="Futura" font-size="11">1,N</text>
<line x1="74" y1="762" x2="74" y2="671" stroke="#bf812d" stroke-width="1"/>
<text x="79.0" y="707" fill="#01665e" font-family="Futura" font-size="11">1,1</text>
<g id="association-DF3">
	<circle cx="74" cy="671" r="20" stroke="#bf812d" stroke-width="1.5" fill="#dfc27d"/>
	<text x="61" y="675.8" fill="#000000" font-family="Copperplate" font-size="18">DF</text>
</g>

<!-- Association DF2 -->
<line x1="387" y1="156" x2="387" y2="264" stroke="#bf812d" stroke-width="1"/>
<text x="392.0" y="219" fill="#01665e" font-family="Futura" font-size="11">1,N</text>
<line x1="387" y1="372" x2="387" y2="264" stroke="#bf812d" stroke-width="1"/>
<text x="392.0" y="300" fill="#01665e" font-family="Futura" font-size="11">1,1</text>
<g id="association-DF2">
	<circle cx="387" cy="264" r="20" stroke="#bf812d" stroke-width="1.5" fill="#dfc27d"/>
	<text x="374" y="268.8" fill="#000000" font-family="Copperplate" font-size="18">DF</text>
</g>

<!-- Association a pour type5 -->
<line x1="387" y1="372" x2="563" y2="372" stroke="#bf812d" stroke-width="1"/>
<text x="441" y="364.0" fill="#01665e" font-family="Futura" font-size="11">0,1</text>
<line x1="700" y1="372" x2="563" y2="372" stroke="#bf812d" stroke-width="1"/>
<text x="629" y="388.0" fill="#01665e" font-family="Futura" font-size="11">1,1</text>
<g id="association-a pour type5">
	<path d="M 609 343 a 14 14 90 0 1 14 14 V 371 h -120 V 357 a 14 14 90 0 1 14 -14" fill="#dfc27d" stroke="#dfc27d" stroke-width="0"/>
	<path d="M 623 371.0 v 16 a 14 14 90 0 1 -14 14 H 517 a 14 14 90 0 1 -14 -14 V 371.0 H 120" fill="#f6e8c3" stroke="#f6e8c3" stroke-width="0"/>
	<rect x="503" y="343" width="120" height="58" fill="none" rx="14" stroke="#bf812d" stroke-width="1.5"/>
	<line x1="503" y1="371" x2="623" y2="371" stroke="#bf812d" stroke-width="1.5"/>
	<text x="510" y="364.3" fill="#000000" font-family="Copperplate" font-size="18">a pour type</text>
</g>

<!-- Association a pour type -->
<line x1="387" y1="372" x2="228" y2="372" stroke="#bf812d" stroke-width="1"/>
<text x="315" y="364.0" fill="#01665e" font-family="Futura" font-size="11">0,1</text>
<line x1="74" y1="372" x2="228" y2="372" stroke="#bf812d" stroke-width="1"/>
<text x="144" y="388.0" fill="#01665e" font-family="Futura" font-size="11">1,1</text>
<g id="association-a pour type">
	<path d="M 274 343 a 14 14 90 0 1 14 14 V 371 h -120 V 357 a 14 14 90 0 1 14 -14" fill="#dfc27d" stroke="#dfc27d" stroke-width="0"/>
	<path d="M 288 371.0 v 16 a 14 14 90 0 1 -14 14 H 182 a 14 14 90 0 1 -14 -14 V 371.0 H 120" fill="#f6e8c3" stroke="#f6e8c3" stroke-width="0"/>
	<rect x="168" y="343" width="120" height="58" fill="none" rx="14" stroke="#bf812d" stroke-width="1.5"/>
	<line x1="168" y1="371" x2="288" y2="371" stroke="#bf812d" stroke-width="1.5"/>
	<text x="175" y="364.3" fill="#000000" font-family="Copperplate" font-size="18">a pour type</text>
</g>

<!-- Association a pour type6 -->
<line x1="387" y1="372" x2="563" y2="489" stroke="#bf812d" stroke-width="1"/>
<text x="441" y="401.670854403" fill="#01665e" font-family="Futura" font-size="11">0,1</text>
<line x1="563" y1="589" x2="563" y2="489" stroke="#bf812d" stroke-width="1"/>
<text x="568.0" y="543" fill="#01665e" font-family="Futura" font-size="11">1,1</text>
<g id="association-a pour type6">
	<path d="M 609 460 a 14 14 90 0 1 14 14 V 488 h -120 V 474 a 14 14 90 0 1 14 -14" fill="#dfc27d" stroke="#dfc27d" stroke-width="0"/>
	<path d="M 623 488.0 v 16 a 14 14 90 0 1 -14 14 H 517 a 14 14 90 0 1 -14 -14 V 488.0 H 120" fill="#f6e8c3" stroke="#f6e8c3" stroke-width="0"/>
	<rect x="503" y="460" width="120" height="58" fill="none" rx="14" stroke="#bf812d" stroke-width="1.5"/>
	<line x1="503" y1="488" x2="623" y2="488" stroke="#bf812d" stroke-width="1.5"/>
	<text x="510" y="481.3" fill="#000000" font-family="Copperplate" font-size="18">a pour type</text>
</g>

<!-- Association a pour type3 -->
<line x1="387" y1="372" x2="228" y2="489" stroke="#bf812d" stroke-width="1"/>
<text x="315" y="405.623198231" fill="#01665e" font-family="Futura" font-size="11">0,1</text>
<line x1="228" y1="589" x2="228" y2="489" stroke="#bf812d" stroke-width="1"/>
<text x="233.0" y="534" fill="#01665e" font-family="Futura" font-size="11">1,1</text>
<g id="association-a pour type3">
	<path d="M 274 460 a 14 14 90 0 1 14 14 V 488 h -120 V 474 a 14 14 90 0 1 14 -14" fill="#dfc27d" stroke="#dfc27d" stroke-width="0"/>
	<path d="M 288 488.0 v 16 a 14 14 90 0 1 -14 14 H 182 a 14 14 90 0 1 -14 -14 V 488.0 H 120" fill="#f6e8c3" stroke="#f6e8c3" stroke-width="0"/>
	<rect x="168" y="460" width="120" height="58" fill="none" rx="14" stroke="#bf812d" stroke-width="1.5"/>
	<line x1="168" y1="488" x2="288" y2="488" stroke="#bf812d" stroke-width="1.5"/>
	<text x="175" y="481.3" fill="#000000" font-family="Copperplate" font-size="18">a pour type</text>
</g>

<!-- Association a pour type2 -->
<line x1="387" y1="372" x2="74" y2="489" stroke="#bf812d" stroke-width="1"/>
<text x="315" y="385.23974053" fill="#01665e" font-family="Futura" font-size="11">0,1</text>
<line x1="74" y1="589" x2="74" y2="489" stroke="#bf812d" stroke-width="1"/>
<text x="79.0" y="543" fill="#01665e" font-family="Futura" font-size="11">1,1</text>
<g id="association-a pour type2">
	<path d="M 120 460 a 14 14 90 0 1 14 14 V 488 h -120 V 474 a 14 14 90 0 1 14 -14" fill="#dfc27d" stroke="#dfc27d" stroke-width="0"/>
	<path d="M 134 488.0 v 16 a 14 14 90 0 1 -14 14 H 28 a 14 14 90 0 1 -14 -14 V 488.0 H 120" fill="#f6e8c3" stroke="#f6e8c3" stroke-width="0"/>
	<rect x="14" y="460" width="120" height="58" fill="none" rx="14" stroke="#bf812d" stroke-width="1.5"/>
	<line x1="14" y1="488" x2="134" y2="488" stroke="#bf812d" stroke-width="1.5"/>
	<text x="21" y="481.3" fill="#000000" font-family="Copperplate" font-size="18">a pour type</text>
</g>

<!-- Association DF4 -->
<line x1="563" y1="589" x2="563" y2="671" stroke="#bf812d" stroke-width="1"/>
<text x="568.0" y="643" fill="#01665e" font-family="Futura" font-size="11">1,N</text>
<line x1="563" y1="762" x2="563" y2="671" stroke="#bf812d" stroke-width="1"/>
<text x="568.0" y="707" fill="#01665e" font-family="Futura" font-size="11">1,1</text>
<g id="association-DF4">
	<circle cx="563" cy="671" r="20" stroke="#bf812d" stroke-width="1.5" fill="#dfc27d"/>
	<text x="550" y="675.8" fill="#000000" font-family="Copperplate" font-size="18">DF</text>
</g>

<!-- Entity QRMO -->
<g id="entity-QRMO">
	<g id="frame-QRMO">
		<rect x="526" y="551" width="74" height="30" fill="#80cdc1" stroke="#80cdc1" stroke-width="0"/>
		<rect x="526" y="581.0" width="74" height="46" fill="#c7eae5" stroke="#c7eae5" stroke-width="0"/>
		<rect x="526" y="551" width="74" height="76" fill="none" stroke="#35978f" stroke-width="1.5"/>
		<line x1="526" y1="581" x2="600" y2="581" stroke="#35978f" stroke-width="1.5"/>
	</g>
	<text x="534" y="572.3" fill="#000000" font-family="Copperplate" font-size="18">QRMO</text>
	<text x="534" y="598.1" fill="#000000" font-family="Gill Sans" font-size="15">id</text>
	<line x1="534" y1="601" x2="546" y2="601" stroke="#000000" stroke-width="1"/>
	<text x="534" y="615.1" fill="#000000" font-family="Gill Sans" font-size="15">libelle</text>
</g>

<!-- Entity texte à trou -->
<g id="entity-texte à trou">
	<g id="frame-texte à trou">
		<rect x="9" y="334" width="130" height="30" fill="#80cdc1" stroke="#80cdc1" stroke-width="0"/>
		<rect x="9" y="364.0" width="130" height="46" fill="#c7eae5" stroke="#c7eae5" stroke-width="0"/>
		<rect x="9" y="334" width="130" height="76" fill="none" stroke="#35978f" stroke-width="1.5"/>
		<line x1="9" y1="364" x2="139" y2="364" stroke="#35978f" stroke-width="1.5"/>
	</g>
	<text x="17" y="355.3" fill="#000000" font-family="Copperplate" font-size="18">texte à trou</text>
	<text x="17" y="381.1" fill="#000000" font-family="Gill Sans" font-size="15">id</text>
	<line x1="17" y1="384" x2="29" y2="384" stroke="#000000" stroke-width="1"/>
	<text x="17" y="398.1" fill="#000000" font-family="Gill Sans" font-size="15">texte</text>
</g>

<!-- Entity deck -->
<g id="entity-deck">
	<g id="frame-deck">
		<rect x="185" y="9" width="86" height="30" fill="#80cdc1" stroke="#80cdc1" stroke-width="0"/>
		<rect x="185" y="39.0" width="86" height="64" fill="#c7eae5" stroke="#c7eae5" stroke-width="0"/>
		<rect x="185" y="9" width="86" height="94" fill="none" stroke="#35978f" stroke-width="1.5"/>
		<line x1="185" y1="39" x2="271" y2="39" stroke="#35978f" stroke-width="1.5"/>
	</g>
	<text x="207" y="30.3" fill="#000000" font-family="Copperplate" font-size="18">deck</text>
	<text x="193" y="56.1" fill="#000000" font-family="Gill Sans" font-size="15">id</text>
	<line x1="193" y1="59" x2="205" y2="59" stroke="#000000" stroke-width="1"/>
	<text x="193" y="73.1" fill="#000000" font-family="Gill Sans" font-size="15">intro_deck</text>
	<text x="193" y="90.0" fill="#000000" font-family="Gill Sans" font-size="15">theme</text>
</g>

<!-- Entity q_assoc -->
<g id="entity-q_assoc">
	<g id="frame-q_assoc">
		<rect x="343" y="559" width="88" height="30" fill="#80cdc1" stroke="#80cdc1" stroke-width="0"/>
		<rect x="343" y="589.0" width="88" height="30" fill="#c7eae5" stroke="#c7eae5" stroke-width="0"/>
		<rect x="343" y="559" width="88" height="60" fill="none" stroke="#35978f" stroke-width="1.5"/>
		<line x1="343" y1="589" x2="431" y2="589" stroke="#35978f" stroke-width="1.5"/>
	</g>
	<text x="351" y="580.3" fill="#000000" font-family="Copperplate" font-size="18">q_assoc</text>
	<text x="351" y="606.1" fill="#000000" font-family="Gill Sans" font-size="15">id</text>
	<line x1="351" y1="609" x2="363" y2="609" stroke="#000000" stroke-width="1"/>
</g>

<!-- Entity question -->
<g id="entity-question">
	<g id="frame-question">
		<rect x="338" y="308" width="98" height="30" fill="#80cdc1" stroke="#80cdc1" stroke-width="0"/>
		<rect x="338" y="338.0" width="98" height="98" fill="#c7eae5" stroke="#c7eae5" stroke-width="0"/>
		<rect x="338" y="308" width="98" height="128" fill="none" stroke="#35978f" stroke-width="1.5"/>
		<line x1="338" y1="338" x2="436" y2="338" stroke="#35978f" stroke-width="1.5"/>
	</g>
	<text x="346" y="329.3" fill="#000000" font-family="Copperplate" font-size="18">question</text>
	<text x="346" y="355.1" fill="#000000" font-family="Gill Sans" font-size="15">id</text>
	<line x1="346" y1="358" x2="358" y2="358" stroke="#000000" stroke-width="1"/>
	<text x="346" y="372.1" fill="#000000" font-family="Gill Sans" font-size="15">libelle</text>
	<text x="346" y="389.1" fill="#000000" font-family="Gill Sans" font-size="15">niveau</text>
	<text x="346" y="406.0" fill="#000000" font-family="Gill Sans" font-size="15">reponse</text>
	<text x="346" y="423.0" fill="#000000" font-family="Gill Sans" font-size="15">explication</text>
</g>

<!-- Entity reponse -->
<g id="entity-reponse">
	<g id="frame-reponse">
		<rect x="182" y="217" width="92" height="30" fill="#80cdc1" stroke="#80cdc1" stroke-width="0"/>
		<rect x="182" y="247.0" width="92" height="64" fill="#c7eae5" stroke="#c7eae5" stroke-width="0"/>
		<rect x="182" y="217" width="92" height="94" fill="none" stroke="#35978f" stroke-width="1.5"/>
		<line x1="182" y1="247" x2="274" y2="247" stroke="#35978f" stroke-width="1.5"/>
	</g>
	<text x="190" y="238.3" fill="#000000" font-family="Copperplate" font-size="18">reponse</text>
	<text x="190" y="264.1" fill="#000000" font-family="Gill Sans" font-size="15">id</text>
	<line x1="190" y1="267" x2="202" y2="267" stroke="#000000" stroke-width="1"/>
	<text x="190" y="281.1" fill="#000000" font-family="Gill Sans" font-size="15">reponse</text>
	<text x="190" y="298.0" fill="#000000" font-family="Gill Sans" font-size="15">position</text>
</g>

<!-- Entity question_fermee -->
<g id="entity-question_fermee">
	<g id="frame-question_fermee">
		<rect x="142" y="542" width="172" height="30" fill="#80cdc1" stroke="#80cdc1" stroke-width="0"/>
		<rect x="142" y="572.0" width="172" height="64" fill="#c7eae5" stroke="#c7eae5" stroke-width="0"/>
		<rect x="142" y="542" width="172" height="94" fill="none" stroke="#35978f" stroke-width="1.5"/>
		<line x1="142" y1="572" x2="314" y2="572" stroke="#35978f" stroke-width="1.5"/>
	</g>
	<text x="150" y="563.3" fill="#000000" font-family="Copperplate" font-size="18">question_fermee</text>
	<text x="150" y="589.1" fill="#000000" font-family="Gill Sans" font-size="15">id</text>
	<line x1="150" y1="592" x2="162" y2="592" stroke="#000000" stroke-width="1"/>
	<text x="150" y="606.1" fill="#000000" font-family="Gill Sans" font-size="15">libelle</text>
	<text x="150" y="623.0" fill="#000000" font-family="Gill Sans" font-size="15">reponse</text>
</g>

<!-- Entity Q simple -->
<g id="entity-Q simple">
	<g id="frame-Q simple">
		<rect x="652" y="325" width="96" height="30" fill="#80cdc1" stroke="#80cdc1" stroke-width="0"/>
		<rect x="652" y="355.0" width="96" height="64" fill="#c7eae5" stroke="#c7eae5" stroke-width="0"/>
		<rect x="652" y="325" width="96" height="94" fill="none" stroke="#35978f" stroke-width="1.5"/>
		<line x1="652" y1="355" x2="748" y2="355" stroke="#35978f" stroke-width="1.5"/>
	</g>
	<text x="660" y="346.3" fill="#000000" font-family="Copperplate" font-size="18">Q simple</text>
	<text x="660" y="372.1" fill="#000000" font-family="Gill Sans" font-size="15">id</text>
	<line x1="660" y1="375" x2="672" y2="375" stroke="#000000" stroke-width="1"/>
	<text x="660" y="389.1" fill="#000000" font-family="Gill Sans" font-size="15">libelle</text>
	<text x="660" y="406.0" fill="#000000" font-family="Gill Sans" font-size="15">reponse</text>
</g>

<!-- Entity proposition -->
<g id="entity-proposition">
	<g id="frame-proposition">
		<rect x="12" y="715" width="124" height="30" fill="#80cdc1" stroke="#80cdc1" stroke-width="0"/>
		<rect x="12" y="745.0" width="124" height="64" fill="#c7eae5" stroke="#c7eae5" stroke-width="0"/>
		<rect x="12" y="715" width="124" height="94" fill="none" stroke="#35978f" stroke-width="1.5"/>
		<line x1="12" y1="745" x2="136" y2="745" stroke="#35978f" stroke-width="1.5"/>
	</g>
	<text x="20" y="736.3" fill="#000000" font-family="Copperplate" font-size="18">proposition</text>
	<text x="20" y="762.1" fill="#000000" font-family="Gill Sans" font-size="15">id</text>
	<line x1="20" y1="765" x2="32" y2="765" stroke="#000000" stroke-width="1"/>
	<text x="20" y="779.1" fill="#000000" font-family="Gill Sans" font-size="15">libelle</text>
	<text x="20" y="796.0" fill="#000000" font-family="Gill Sans" font-size="15">reponse</text>
</g>

<!-- Entity QCM -->
<g id="entity-QCM">
	<g id="frame-QCM">
		<rect x="44" y="551" width="60" height="30" fill="#80cdc1" stroke="#80cdc1" stroke-width="0"/>
		<rect x="44" y="581.0" width="60" height="46" fill="#c7eae5" stroke="#c7eae5" stroke-width="0"/>
		<rect x="44" y="551" width="60" height="76" fill="none" stroke="#35978f" stroke-width="1.5"/>
		<line x1="44" y1="581" x2="104" y2="581" stroke="#35978f" stroke-width="1.5"/>
	</g>
	<text x="52" y="572.3" fill="#000000" font-family="Copperplate" font-size="18">QCM</text>
	<text x="52" y="598.1" fill="#000000" font-family="Gill Sans" font-size="15">id</text>
	<line x1="52" y1="601" x2="64" y2="601" stroke="#000000" stroke-width="1"/>
	<text x="52" y="615.1" fill="#000000" font-family="Gill Sans" font-size="15">libelle</text>
</g>

<!-- Entity apprenant -->
<g id="entity-apprenant">
	<g id="frame-apprenant">
		<rect x="18" y="92" width="112" height="30" fill="#80cdc1" stroke="#80cdc1" stroke-width="0"/>
		<rect x="18" y="122.0" width="112" height="98" fill="#c7eae5" stroke="#c7eae5" stroke-width="0"/>
		<rect x="18" y="92" width="112" height="128" fill="none" stroke="#35978f" stroke-width="1.5"/>
		<line x1="18" y1="122" x2="130" y2="122" stroke="#35978f" stroke-width="1.5"/>
	</g>
	<text x="26" y="113.3" fill="#000000" font-family="Copperplate" font-size="18">apprenant</text>
	<text x="26" y="139.1" fill="#000000" font-family="Gill Sans" font-size="15">id</text>
	<line x1="26" y1="142" x2="38" y2="142" stroke="#000000" stroke-width="1"/>
	<text x="26" y="156.1" fill="#000000" font-family="Gill Sans" font-size="15">nom</text>
	<text x="26" y="173.1" fill="#000000" font-family="Gill Sans" font-size="15">prenom</text>
	<text x="26" y="190.0" fill="#000000" font-family="Gill Sans" font-size="15">login</text>
	<text x="26" y="207.0" fill="#000000" font-family="Gill Sans" font-size="15">password</text>
</g>

<!-- Entity proposition RMO -->
<g id="entity-proposition RMO">
	<g id="frame-proposition RMO">
		<rect x="477" y="715" width="172" height="30" fill="#80cdc1" stroke="#80cdc1" stroke-width="0"/>
		<rect x="477" y="745.0" width="172" height="64" fill="#c7eae5" stroke="#c7eae5" stroke-width="0"/>
		<rect x="477" y="715" width="172" height="94" fill="none" stroke="#35978f" stroke-width="1.5"/>
		<line x1="477" y1="745" x2="649" y2="745" stroke="#35978f" stroke-width="1.5"/>
	</g>
	<text x="485" y="736.3" fill="#000000" font-family="Copperplate" font-size="18">proposition RMO</text>
	<text x="485" y="762.1" fill="#000000" font-family="Gill Sans" font-size="15">id</text>
	<line x1="485" y1="765" x2="497" y2="765" stroke="#000000" stroke-width="1"/>
	<text x="485" y="779.1" fill="#000000" font-family="Gill Sans" font-size="15">libelle</text>
	<text x="485" y="796.0" fill="#000000" font-family="Gill Sans" font-size="15">ordre</text>
</g>

<!-- Entity association -->
<g id="entity-association">
	<g id="frame-association">
		<rect x="326" y="715" width="122" height="30" fill="#80cdc1" stroke="#80cdc1" stroke-width="0"/>
		<rect x="326" y="745.0" width="122" height="64" fill="#c7eae5" stroke="#c7eae5" stroke-width="0"/>
		<rect x="326" y="715" width="122" height="94" fill="none" stroke="#35978f" stroke-width="1.5"/>
		<line x1="326" y1="745" x2="448" y2="745" stroke="#35978f" stroke-width="1.5"/>
	</g>
	<text x="334" y="736.3" fill="#000000" font-family="Copperplate" font-size="18">association</text>
	<text x="334" y="762.1" fill="#000000" font-family="Gill Sans" font-size="15">id</text>
	<line x1="334" y1="765" x2="346" y2="765" stroke="#000000" stroke-width="1"/>
	<text x="334" y="779.1" fill="#000000" font-family="Gill Sans" font-size="15">proposition</text>
	<text x="334" y="796.0" fill="#000000" font-family="Gill Sans" font-size="15">complement</text>
</g>

<!-- Entity carte -->
<g id="entity-carte">
	<g id="frame-carte">
		<rect x="343" y="109" width="88" height="30" fill="#80cdc1" stroke="#80cdc1" stroke-width="0"/>
		<rect x="343" y="139.0" width="88" height="64" fill="#c7eae5" stroke="#c7eae5" stroke-width="0"/>
		<rect x="343" y="109" width="88" height="94" fill="none" stroke="#35978f" stroke-width="1.5"/>
		<line x1="343" y1="139" x2="431" y2="139" stroke="#35978f" stroke-width="1.5"/>
	</g>
	<text x="361" y="130.3" fill="#000000" font-family="Copperplate" font-size="18">carte</text>
	<text x="351" y="156.1" fill="#000000" font-family="Gill Sans" font-size="15">id</text>
	<line x1="351" y1="159" x2="363" y2="159" stroke="#000000" stroke-width="1"/>
	<text x="351" y="173.1" fill="#000000" font-family="Gill Sans" font-size="15">titre</text>
	<text x="351" y="190.0" fill="#000000" font-family="Gill Sans" font-size="15">intro_carte</text>
</g>
</svg>