<?xml version="1.0" standalone="no"?>
<!DOCTYPE svg PUBLIC "-//W3C//DTD SVG 1.1//EN"
"http://www.w3.org/Graphics/SVG/1.1/DTD/svg11.dtd">

<svg width="380" height="298" view_box="0 0 380 298"
xmlns="http://www.w3.org/2000/svg"
xmlns:link="http://www.w3.org/1999/xlink">\n\n<desc>Généré par Mocodo 2.3.7 le Tue, 28 Feb 2017 14:58:03</desc>

<rect id="frame" x="0" y="0" width="380" height="298" fill="none" stroke="none" stroke-width="0"/>

<!-- Association envoyer -->
<line x1="70" y1="90" x2="205" y2="90" stroke="#726f83" stroke-width="1"/>
<text x="136" y="106.0" fill="#726f83" font-family="Futura" font-size="11">0,N</text>
<line x1="205" y1="242" x2="205" y2="90" stroke="#726f83" stroke-width="1"/>
<text x="210.0" y="187" fill="#726f83" font-family="Futura" font-size="11">0,N</text>
<line x1="325" y1="90" x2="205" y2="90" stroke="#726f83" stroke-width="1"/>
<text x="256" y="106.0" fill="#726f83" font-family="Futura" font-size="11">1,1</text>
<g id="association-envoyer">
	<path d="M 236 61 a 14 14 90 0 1 14 14 V 89 h -90 V 75 a 14 14 90 0 1 14 -14" fill="#b2bba4" stroke="#b2bba4" stroke-width="0"/>
	<path d="M 250 89.0 v 16 a 14 14 90 0 1 -14 14 H 174 a 14 14 90 0 1 -14 -14 V 89.0 H 90" fill="#ccd6ba" stroke="#ccd6ba" stroke-width="0"/>
	<rect x="160" y="61" width="90" height="58" fill="none" rx="14" stroke="#85956b" stroke-width="1.5"/>
	<line x1="160" y1="89" x2="250" y2="89" stroke="#85956b" stroke-width="1.5"/>
	<text x="167" y="82.3" fill="#27360c" font-family="Copperplate" font-size="18">envoyer</text>
</g>

<!-- Entity utilisateur -->
<g id="entity-utilisateur">
	<g id="frame-utilisateur">
		<rect x="9" y="9" width="122" height="30" fill="#97b8ff" stroke="#97b8ff" stroke-width="0"/>
		<rect x="9" y="39.0" width="122" height="132" fill="#c0d4ff" stroke="#c0d4ff" stroke-width="0"/>
		<rect x="9" y="9" width="122" height="162" fill="none" stroke="#578dff" stroke-width="1.5"/>
		<line x1="9" y1="39" x2="131" y2="39" stroke="#578dff" stroke-width="1.5"/>
	</g>
	<text x="17" y="30.3" fill="#131114" font-family="Copperplate" font-size="18">utilisateur</text>
	<text x="17" y="56.0" fill="#3e3c42" font-family="Gill Sans" font-size="15">id</text>
	<line x1="17" y1="59" x2="29" y2="59" stroke="#3e3c42" stroke-width="1"/>
	<text x="17" y="73.1" fill="#3e3c42" font-family="Gill Sans" font-size="15">nom</text>
	<text x="17" y="90.1" fill="#3e3c42" font-family="Gill Sans" font-size="15">prenom</text>
	<text x="17" y="107.1" fill="#3e3c42" font-family="Gill Sans" font-size="15">pseudo</text>
	<text x="17" y="124.0" fill="#3e3c42" font-family="Gill Sans" font-size="15">email</text>
	<text x="17" y="141.0" fill="#3e3c42" font-family="Gill Sans" font-size="15">mdp</text>
	<text x="17" y="158.0" fill="#3e3c42" font-family="Gill Sans" font-size="15">avatar</text>
</g>

<!-- Entity message -->
<g id="entity-message">
	<g id="frame-message">
		<rect x="279" y="43" width="92" height="30" fill="#97b8ff" stroke="#97b8ff" stroke-width="0"/>
		<rect x="279" y="73.0" width="92" height="64" fill="#c0d4ff" stroke="#c0d4ff" stroke-width="0"/>
		<rect x="279" y="43" width="92" height="94" fill="none" stroke="#578dff" stroke-width="1.5"/>
		<line x1="279" y1="73" x2="371" y2="73" stroke="#578dff" stroke-width="1.5"/>
	</g>
	<text x="287" y="64.3" fill="#131114" font-family="Copperplate" font-size="18">message</text>
	<text x="287" y="90.1" fill="#3e3c42" font-family="Gill Sans" font-size="15">id</text>
	<line x1="287" y1="93" x2="299" y2="93" stroke="#3e3c42" stroke-width="1"/>
	<text x="287" y="107.1" fill="#3e3c42" font-family="Gill Sans" font-size="15">date</text>
	<text x="287" y="124.0" fill="#3e3c42" font-family="Gill Sans" font-size="15">contenu</text>
</g>

<!-- Entity discussion -->
<g id="entity-discussion">
	<g id="frame-discussion">
		<rect x="147" y="195" width="116" height="30" fill="#97b8ff" stroke="#97b8ff" stroke-width="0"/>
		<rect x="147" y="225.0" width="116" height="64" fill="#c0d4ff" stroke="#c0d4ff" stroke-width="0"/>
		<rect x="147" y="195" width="116" height="94" fill="none" stroke="#578dff" stroke-width="1.5"/>
		<line x1="147" y1="225" x2="263" y2="225" stroke="#578dff" stroke-width="1.5"/>
	</g>
	<text x="155" y="216.3" fill="#131114" font-family="Copperplate" font-size="18">discussion</text>
	<text x="155" y="242.1" fill="#3e3c42" font-family="Gill Sans" font-size="15">id</text>
	<line x1="155" y1="245" x2="167" y2="245" stroke="#3e3c42" stroke-width="1"/>
	<text x="155" y="259.1" fill="#3e3c42" font-family="Gill Sans" font-size="15">nom</text>
	<text x="155" y="276.0" fill="#3e3c42" font-family="Gill Sans" font-size="15">mdp</text>
</g>
</svg>