<?xml version="1.0" standalone="no"?>
<!DOCTYPE svg PUBLIC "-//W3C//DTD SVG 1.1//EN"
"http://www.w3.org/Graphics/SVG/1.1/DTD/svg11.dtd">

<svg width="720" height="827" view_box="0 0 720 827"
xmlns="http://www.w3.org/2000/svg"
xmlns:link="http://www.w3.org/1999/xlink">\n\n<desc>Généré par Mocodo 2.3.7 le Fri, 17 Feb 2017 14:15:31</desc>

<rect id="frame" x="0" y="0" width="720" height="827" fill="#f5f5f5" stroke="none" stroke-width="0"/>

<!-- Association apprendre -->
<line x1="74" y1="156" x2="228" y2="156" stroke="#bf812d" stroke-width="1"/>
<text x="135" y="172.0" fill="#01665e" font-family="Futura" font-size="11">1,N</text>
<line x1="377" y1="156" x2="228" y2="156" stroke="#bf812d" stroke-width="1"/>
<text x="309" y="172.0" fill="#01665e" font-family="Futura" font-size="11">0,N</text>
<g id="association-apprendre">
	<path d="M 269 127 a 14 14 90 0 1 14 14 V 155 h -110 V 141 a 14 14 90 0 1 14 -14" fill="#dfc27d" stroke="#dfc27d" stroke-width="0"/>
	<path d="M 283 155.0 v 16 a 14 14 90 0 1 -14 14 H 187 a 14 14 90 0 1 -14 -14 V 155.0 H 110" fill="#f6e8c3" stroke="#f6e8c3" stroke-width="0"/>
	<rect x="173" y="127" width="110" height="58" fill="none" rx="14" stroke="#bf812d" stroke-width="1.5"/>
	<line x1="173" y1="155" x2="283" y2="155" stroke="#bf812d" stroke-width="1.5"/>
	<text x="180" y="148.3" fill="#000000" font-family="Copperplate" font-size="18">apprendre</text>
	<text x="180" y="173.1" fill="#000000" font-family="Gill Sans" font-size="15">niveau</text>
</g>

<!-- Association a pour type4 -->
<line x1="377" y1="372" x2="377" y2="489" stroke="#bf812d" stroke-width="1"/>
<text x="382.0" y="452" fill="#01665e" font-family="Futura" font-size="11">0,1</text>
<line x1="377" y1="589" x2="377" y2="489" stroke="#bf812d" stroke-width="1"/>
<text x="382.0" y="534" fill="#01665e" font-family="Futura" font-size="11">1,1</text>
<g id="association-a pour type4">
	<path d="M 423 460 a 14 14 90 0 1 14 14 V 488 h -120 V 474 a 14 14 90 0 1 14 -14" fill="#dfc27d" stroke="#dfc27d" stroke-width="0"/>
	<path d="M 437 488.0 v 16 a 14 14 90 0 1 -14 14 H 331 a 14 14 90 0 1 -14 -14 V 488.0 H 120" fill="#f6e8c3" stroke="#f6e8c3" stroke-width="0"/>
	<rect x="317" y="460" width="120" height="58" fill="none" rx="14" stroke="#bf812d" stroke-width="1.5"/>
	<line x1="317" y1="488" x2="437" y2="488" stroke="#bf812d" stroke-width="1.5"/>
	<text x="324" y="481.3" fill="#000000" font-family="Copperplate" font-size="18">a pour type</text>
</g>

<!-- Association DF5 -->
<line x1="228" y1="264" x2="74" y2="264" stroke="#bf812d" stroke-width="1"/>
<text x="158" y="280.0" fill="#01665e" font-family="Futura" font-size="11">1,N</text>
<line x1="74" y1="372" x2="74" y2="264" stroke="#bf812d" stroke-width="1"/>
<text x="79.0" y="326" fill="#01665e" font-family="Futura" font-size="11">1,1</text>
<g id="association-DF5">
	<circle cx="74" cy="264" r="20" stroke="#bf812d" stroke-width="1.5" fill="#dfc27d"/>
	<text x="61" y="268.8" fill="#000000" font-family="Copperplate" font-size="18">DF</text>
</g>

<!-- Association DF1 -->
<line x1="228" y1="56" x2="377" y2="56" stroke="#bf812d" stroke-width="1"/>
<text x="276" y="72.0" fill="#01665e" font-family="Futura" font-size="11">0,N</text>
<line x1="377" y1="156" x2="377" y2="56" stroke="#bf812d" stroke-width="1"/>
<text x="382.0" y="101" fill="#01665e" font-family="Futura" font-size="11">1,1</text>
<g id="association-DF1">
	<circle cx="377" cy="56" r="20" stroke="#bf812d" stroke-width="1.5" fill="#dfc27d"/>
	<text x="364" y="60.8" fill="#000000" font-family="Copperplate" font-size="18">DF</text>
</g>

<!-- Association debloquer -->
<path d="M377 156 C 405.333333333 124.0 455.0 124.0 526 156" fill="none" stroke="#bf812d" stroke-width="1"/>
<text x="426" y="149.0" fill="#01665e" font-family="Futura" font-size="11">0,N</text>
<path d="M377 156 C 405.333333333 188.0 455.0 188.0 526 156" fill="none" stroke="#bf812d" stroke-width="1"/>
<text x="426" y="171.0" fill="#01665e" font-family="Futura" font-size="11">1,N</text>
<g id="association-debloquer">
	<path d="M 568 127 a 14 14 90 0 1 14 14 V 155 h -112 V 141 a 14 14 90 0 1 14 -14" fill="#dfc27d" stroke="#dfc27d" stroke-width="0"/>
	<path d="M 582 155.0 v 16 a 14 14 90 0 1 -14 14 H 484 a 14 14 90 0 1 -14 -14 V 155.0 H 112" fill="#f6e8c3" stroke="#f6e8c3" stroke-width="0"/>
	<rect x="470" y="127" width="112" height="58" fill="none" rx="14" stroke="#bf812d" stroke-width="1.5"/>
	<line x1="470" y1="155" x2="582" y2="155" stroke="#bf812d" stroke-width="1.5"/>
	<text x="477" y="148.3" fill="#000000" font-family="Copperplate" font-size="18">debloquer</text>
	<text x="477" y="173.1" fill="#000000" font-family="Gill Sans" font-size="15">niveau</text>
</g>

<!-- Association DF3 -->
<line x1="74" y1="589" x2="74" y2="680" stroke="#bf812d" stroke-width="1"/>
<text x="79.0" y="652" fill="#01665e" font-family="Futura" font-size="11">1,N</text>
<line x1="74" y1="771" x2="74" y2="680" stroke="#bf812d" stroke-width="1"/>
<text x="79.0" y="716" fill="#01665e" font-family="Futura" font-size="11">1,1</text>
<g id="association-DF3">
	<circle cx="74" cy="680" r="20" stroke="#bf812d" stroke-width="1.5" fill="#dfc27d"/>
	<text x="61" y="684.8" fill="#000000" font-family="Copperplate" font-size="18">DF</text>
</g>

<!-- Association DF2 -->
<line x1="377" y1="156" x2="377" y2="264" stroke="#bf812d" stroke-width="1"/>
<text x="382.0" y="219" fill="#01665e" font-family="Futura" font-size="11">1,N</text>
<line x1="377" y1="372" x2="377" y2="264" stroke="#bf812d" stroke-width="1"/>
<text x="382.0" y="300" fill="#01665e" font-family="Futura" font-size="11">1,1</text>
<g id="association-DF2">
	<circle cx="377" cy="264" r="20" stroke="#bf812d" stroke-width="1.5" fill="#dfc27d"/>
	<text x="364" y="268.8" fill="#000000" font-family="Copperplate" font-size="18">DF</text>
</g>

<!-- Association a pour type5 -->
<line x1="377" y1="372" x2="526" y2="372" stroke="#bf812d" stroke-width="1"/>
<text x="431" y="364.0" fill="#01665e" font-family="Futura" font-size="11">0,1</text>
<line x1="663" y1="372" x2="526" y2="372" stroke="#bf812d" stroke-width="1"/>
<text x="592" y="388.0" fill="#01665e" font-family="Futura" font-size="11">1,1</text>
<g id="association-a pour type5">
	<path d="M 572 343 a 14 14 90 0 1 14 14 V 371 h -120 V 357 a 14 14 90 0 1 14 -14" fill="#dfc27d" stroke="#dfc27d" stroke-width="0"/>
	<path d="M 586 371.0 v 16 a 14 14 90 0 1 -14 14 H 480 a 14 14 90 0 1 -14 -14 V 371.0 H 120" fill="#f6e8c3" stroke="#f6e8c3" stroke-width="0"/>
	<rect x="466" y="343" width="120" height="58" fill="none" rx="14" stroke="#bf812d" stroke-width="1.5"/>
	<line x1="466" y1="371" x2="586" y2="371" stroke="#bf812d" stroke-width="1.5"/>
	<text x="473" y="364.3" fill="#000000" font-family="Copperplate" font-size="18">a pour type</text>
</g>

<!-- Association a pour type -->
<line x1="377" y1="372" x2="228" y2="372" stroke="#bf812d" stroke-width="1"/>
<text x="305" y="364.0" fill="#01665e" font-family="Futura" font-size="11">0,1</text>
<line x1="74" y1="372" x2="228" y2="372" stroke="#bf812d" stroke-width="1"/>
<text x="144" y="388.0" fill="#01665e" font-family="Futura" font-size="11">1,1</text>
<g id="association-a pour type">
	<path d="M 274 343 a 14 14 90 0 1 14 14 V 371 h -120 V 357 a 14 14 90 0 1 14 -14" fill="#dfc27d" stroke="#dfc27d" stroke-width="0"/>
	<path d="M 288 371.0 v 16 a 14 14 90 0 1 -14 14 H 182 a 14 14 90 0 1 -14 -14 V 371.0 H 120" fill="#f6e8c3" stroke="#f6e8c3" stroke-width="0"/>
	<rect x="168" y="343" width="120" height="58" fill="none" rx="14" stroke="#bf812d" stroke-width="1.5"/>
	<line x1="168" y1="371" x2="288" y2="371" stroke="#bf812d" stroke-width="1.5"/>
	<text x="175" y="364.3" fill="#000000" font-family="Copperplate" font-size="18">a pour type</text>
</g>

<!-- Association a pour type6 -->
<line x1="377" y1="372" x2="526" y2="489" stroke="#bf812d" stroke-width="1"/>
<text x="431" y="408.353125766" fill="#01665e" font-family="Futura" font-size="11">0,1</text>
<line x1="526" y1="589" x2="526" y2="489" stroke="#bf812d" stroke-width="1"/>
<text x="531.0" y="543" fill="#01665e" font-family="Futura" font-size="11">1,1</text>
<g id="association-a pour type6">
	<path d="M 572 460 a 14 14 90 0 1 14 14 V 488 h -120 V 474 a 14 14 90 0 1 14 -14" fill="#dfc27d" stroke="#dfc27d" stroke-width="0"/>
	<path d="M 586 488.0 v 16 a 14 14 90 0 1 -14 14 H 480 a 14 14 90 0 1 -14 -14 V 488.0 H 120" fill="#f6e8c3" stroke="#f6e8c3" stroke-width="0"/>
	<rect x="466" y="460" width="120" height="58" fill="none" rx="14" stroke="#bf812d" stroke-width="1.5"/>
	<line x1="466" y1="488" x2="586" y2="488" stroke="#bf812d" stroke-width="1.5"/>
	<text x="473" y="481.3" fill="#000000" font-family="Copperplate" font-size="18">a pour type</text>
</g>

<!-- Association a pour type3 -->
<line x1="377" y1="372" x2="228" y2="489" stroke="#bf812d" stroke-width="1"/>
<text x="305" y="408.353125766" fill="#01665e" font-family="Futura" font-size="11">0,1</text>
<line x1="228" y1="589" x2="228" y2="489" stroke="#bf812d" stroke-width="1"/>
<text x="233.0" y="534" fill="#01665e" font-family="Futura" font-size="11">1,1</text>
<g id="association-a pour type3">
	<path d="M 274 460 a 14 14 90 0 1 14 14 V 488 h -120 V 474 a 14 14 90 0 1 14 -14" fill="#dfc27d" stroke="#dfc27d" stroke-width="0"/>
	<path d="M 288 488.0 v 16 a 14 14 90 0 1 -14 14 H 182 a 14 14 90 0 1 -14 -14 V 488.0 H 120" fill="#f6e8c3" stroke="#f6e8c3" stroke-width="0"/>
	<rect x="168" y="460" width="120" height="58" fill="none" rx="14" stroke="#bf812d" stroke-width="1.5"/>
	<line x1="168" y1="488" x2="288" y2="488" stroke="#bf812d" stroke-width="1.5"/>
	<text x="175" y="481.3" fill="#000000" font-family="Copperplate" font-size="18">a pour type</text>
</g>

<!-- Association a pour type2 -->
<line x1="377" y1="372" x2="74" y2="489" stroke="#bf812d" stroke-width="1"/>
<text x="305" y="385.942569329" fill="#01665e" font-family="Futura" font-size="11">0,1</text>
<line x1="74" y1="589" x2="74" y2="489" stroke="#bf812d" stroke-width="1"/>
<text x="79.0" y="534" fill="#01665e" font-family="Futura" font-size="11">1,1</text>
<g id="association-a pour type2">
	<path d="M 120 460 a 14 14 90 0 1 14 14 V 488 h -120 V 474 a 14 14 90 0 1 14 -14" fill="#dfc27d" stroke="#dfc27d" stroke-width="0"/>
	<path d="M 134 488.0 v 16 a 14 14 90 0 1 -14 14 H 28 a 14 14 90 0 1 -14 -14 V 488.0 H 120" fill="#f6e8c3" stroke="#f6e8c3" stroke-width="0"/>
	<rect x="14" y="460" width="120" height="58" fill="none" rx="14" stroke="#bf812d" stroke-width="1.5"/>
	<line x1="14" y1="488" x2="134" y2="488" stroke="#bf812d" stroke-width="1.5"/>
	<text x="21" y="481.3" fill="#000000" font-family="Copperplate" font-size="18">a pour type</text>
</g>

<!-- Association DF4 -->
<line x1="526" y1="589" x2="526" y2="680" stroke="#bf812d" stroke-width="1"/>
<text x="531.0" y="643" fill="#01665e" font-family="Futura" font-size="11">1,N</text>
<line x1="526" y1="771" x2="526" y2="680" stroke="#bf812d" stroke-width="1"/>
<text x="531.0" y="716" fill="#01665e" font-family="Futura" font-size="11">1,1</text>
<g id="association-DF4">
	<circle cx="526" cy="680" r="20" stroke="#bf812d" stroke-width="1.5" fill="#dfc27d"/>
	<text x="513" y="684.8" fill="#000000" font-family="Copperplate" font-size="18">DF</text>
</g>

<!-- Entity QRMO -->
<g id="entity-QRMO">
	<g id="frame-QRMO">
		<rect x="489" y="551" width="74" height="30" fill="#80cdc1" stroke="#80cdc1" stroke-width="0"/>
		<rect x="489" y="581.0" width="74" height="46" fill="#c7eae5" stroke="#c7eae5" stroke-width="0"/>
		<rect x="489" y="551" width="74" height="76" fill="none" stroke="#35978f" stroke-width="1.5"/>
		<line x1="489" y1="581" x2="563" y2="581" stroke="#35978f" stroke-width="1.5"/>
	</g>
	<text x="497" y="572.3" fill="#000000" font-family="Copperplate" font-size="18">QRMO</text>
	<text x="497" y="598.1" fill="#000000" font-family="Gill Sans" font-size="15">id</text>
	<line x1="497" y1="601" x2="509" y2="601" stroke="#000000" stroke-width="1"/>
	<text x="497" y="615.1" fill="#000000" font-family="Gill Sans" font-size="15">libelle</text>
</g>

<!-- Entity texte à trou -->
<g id="entity-texte à trou">
	<g id="frame-texte à trou">
		<rect x="9" y="334" width="130" height="30" fill="#80cdc1" stroke="#80cdc1" stroke-width="0"/>
		<rect x="9" y="364.0" width="130" height="46" fill="#c7eae5" stroke="#c7eae5" stroke-width="0"/>
		<rect x="9" y="334" width="130" height="76" fill="none" stroke="#35978f" stroke-width="1.5"/>
		<line x1="9" y1="364" x2="139" y2="364" stroke="#35978f" stroke-width="1.5"/>
	</g>
	<text x="17" y="355.3" fill="#000000" font-family="Copperplate" font-size="18">texte à trou</text>
	<text x="17" y="381.1" fill="#000000" font-family="Gill Sans" font-size="15">id</text>
	<line x1="17" y1="384" x2="29" y2="384" stroke="#000000" stroke-width="1"/>
	<text x="17" y="398.1" fill="#000000" font-family="Gill Sans" font-size="15">texte</text>
</g>

<!-- Entity deck -->
<g id="entity-deck">
	<g id="frame-deck">
		<rect x="185" y="9" width="86" height="30" fill="#80cdc1" stroke="#80cdc1" stroke-width="0"/>
		<rect x="185" y="39.0" width="86" height="64" fill="#c7eae5" stroke="#c7eae5" stroke-width="0"/>
		<rect x="185" y="9" width="86" height="94" fill="none" stroke="#35978f" stroke-width="1.5"/>
		<line x1="185" y1="39" x2="271" y2="39" stroke="#35978f" stroke-width="1.5"/>
	</g>
	<text x="207" y="30.3" fill="#000000" font-family="Copperplate" font-size="18">deck</text>
	<text x="193" y="56.1" fill="#000000" font-family="Gill Sans" font-size="15">id</text>
	<line x1="193" y1="59" x2="205" y2="59" stroke="#000000" stroke-width="1"/>
	<text x="193" y="73.1" fill="#000000" font-family="Gill Sans" font-size="15">intro_deck</text>
	<text x="193" y="90.0" fill="#000000" font-family="Gill Sans" font-size="15">theme</text>
</g>

<!-- Entity question -->
<g id="entity-question">
	<g id="frame-question">
		<rect x="328" y="308" width="98" height="30" fill="#80cdc1" stroke="#80cdc1" stroke-width="0"/>
		<rect x="328" y="338.0" width="98" height="98" fill="#c7eae5" stroke="#c7eae5" stroke-width="0"/>
		<rect x="328" y="308" width="98" height="128" fill="none" stroke="#35978f" stroke-width="1.5"/>
		<line x1="328" y1="338" x2="426" y2="338" stroke="#35978f" stroke-width="1.5"/>
	</g>
	<text x="336" y="329.3" fill="#000000" font-family="Copperplate" font-size="18">question</text>
	<text x="336" y="355.1" fill="#000000" font-family="Gill Sans" font-size="15">id</text>
	<line x1="336" y1="358" x2="348" y2="358" stroke="#000000" stroke-width="1"/>
	<text x="336" y="372.1" fill="#000000" font-family="Gill Sans" font-size="15">libelle</text>
	<text x="336" y="389.1" fill="#000000" font-family="Gill Sans" font-size="15">niveau</text>
	<text x="336" y="406.0" fill="#000000" font-family="Gill Sans" font-size="15">reponse</text>
	<text x="336" y="423.0" fill="#000000" font-family="Gill Sans" font-size="15">explication</text>
</g>

<!-- Entity reponse -->
<g id="entity-reponse">
	<g id="frame-reponse">
		<rect x="182" y="217" width="92" height="30" fill="#80cdc1" stroke="#80cdc1" stroke-width="0"/>
		<rect x="182" y="247.0" width="92" height="64" fill="#c7eae5" stroke="#c7eae5" stroke-width="0"/>
		<rect x="182" y="217" width="92" height="94" fill="none" stroke="#35978f" stroke-width="1.5"/>
		<line x1="182" y1="247" x2="274" y2="247" stroke="#35978f" stroke-width="1.5"/>
	</g>
	<text x="190" y="238.3" fill="#000000" font-family="Copperplate" font-size="18">reponse</text>
	<text x="190" y="264.1" fill="#000000" font-family="Gill Sans" font-size="15">id</text>
	<line x1="190" y1="267" x2="202" y2="267" stroke="#000000" stroke-width="1"/>
	<text x="190" y="281.1" fill="#000000" font-family="Gill Sans" font-size="15">reponse</text>
	<text x="190" y="298.0" fill="#000000" font-family="Gill Sans" font-size="15">position</text>
</g>

<!-- Entity Q simple -->
<g id="entity-Q simple">
	<g id="frame-Q simple">
		<rect x="615" y="325" width="96" height="30" fill="#80cdc1" stroke="#80cdc1" stroke-width="0"/>
		<rect x="615" y="355.0" width="96" height="64" fill="#c7eae5" stroke="#c7eae5" stroke-width="0"/>
		<rect x="615" y="325" width="96" height="94" fill="none" stroke="#35978f" stroke-width="1.5"/>
		<line x1="615" y1="355" x2="711" y2="355" stroke="#35978f" stroke-width="1.5"/>
	</g>
	<text x="623" y="346.3" fill="#000000" font-family="Copperplate" font-size="18">Q simple</text>
	<text x="623" y="372.1" fill="#000000" font-family="Gill Sans" font-size="15">id</text>
	<line x1="623" y1="375" x2="635" y2="375" stroke="#000000" stroke-width="1"/>
	<text x="623" y="389.1" fill="#000000" font-family="Gill Sans" font-size="15">libelle</text>
	<text x="623" y="406.0" fill="#000000" font-family="Gill Sans" font-size="15">reponse</text>
</g>

<!-- Entity proposition -->
<g id="entity-proposition">
	<g id="frame-proposition">
		<rect x="12" y="724" width="124" height="30" fill="#80cdc1" stroke="#80cdc1" stroke-width="0"/>
		<rect x="12" y="754.0" width="124" height="64" fill="#c7eae5" stroke="#c7eae5" stroke-width="0"/>
		<rect x="12" y="724" width="124" height="94" fill="none" stroke="#35978f" stroke-width="1.5"/>
		<line x1="12" y1="754" x2="136" y2="754" stroke="#35978f" stroke-width="1.5"/>
	</g>
	<text x="20" y="745.3" fill="#000000" font-family="Copperplate" font-size="18">proposition</text>
	<text x="20" y="771.1" fill="#000000" font-family="Gill Sans" font-size="15">id</text>
	<line x1="20" y1="774" x2="32" y2="774" stroke="#000000" stroke-width="1"/>
	<text x="20" y="788.1" fill="#000000" font-family="Gill Sans" font-size="15">libelle</text>
	<text x="20" y="805.0" fill="#000000" font-family="Gill Sans" font-size="15">reponse</text>
</g>

<!-- Entity QCM -->
<g id="entity-QCM">
	<g id="frame-QCM">
		<rect x="44" y="542" width="60" height="30" fill="#80cdc1" stroke="#80cdc1" stroke-width="0"/>
		<rect x="44" y="572.0" width="60" height="64" fill="#c7eae5" stroke="#c7eae5" stroke-width="0"/>
		<rect x="44" y="542" width="60" height="94" fill="none" stroke="#35978f" stroke-width="1.5"/>
		<line x1="44" y1="572" x2="104" y2="572" stroke="#35978f" stroke-width="1.5"/>
	</g>
	<text x="52" y="563.3" fill="#000000" font-family="Copperplate" font-size="18">QCM</text>
	<text x="52" y="589.1" fill="#000000" font-family="Gill Sans" font-size="15">id</text>
	<line x1="52" y1="592" x2="64" y2="592" stroke="#000000" stroke-width="1"/>
	<text x="52" y="606.1" fill="#000000" font-family="Gill Sans" font-size="15">QCM</text>
	<text x="52" y="623.0" fill="#000000" font-family="Gill Sans" font-size="15">QCU</text>
</g>

<!-- Entity apprenant -->
<g id="entity-apprenant">
	<g id="frame-apprenant">
		<rect x="18" y="92" width="112" height="30" fill="#80cdc1" stroke="#80cdc1" stroke-width="0"/>
		<rect x="18" y="122.0" width="112" height="98" fill="#c7eae5" stroke="#c7eae5" stroke-width="0"/>
		<rect x="18" y="92" width="112" height="128" fill="none" stroke="#35978f" stroke-width="1.5"/>
		<line x1="18" y1="122" x2="130" y2="122" stroke="#35978f" stroke-width="1.5"/>
	</g>
	<text x="26" y="113.3" fill="#000000" font-family="Copperplate" font-size="18">apprenant</text>
	<text x="26" y="139.1" fill="#000000" font-family="Gill Sans" font-size="15">id</text>
	<line x1="26" y1="142" x2="38" y2="142" stroke="#000000" stroke-width="1"/>
	<text x="26" y="156.1" fill="#000000" font-family="Gill Sans" font-size="15">nom</text>
	<text x="26" y="173.1" fill="#000000" font-family="Gill Sans" font-size="15">prenom</text>
	<text x="26" y="190.0" fill="#000000" font-family="Gill Sans" font-size="15">login</text>
	<text x="26" y="207.0" fill="#000000" font-family="Gill Sans" font-size="15">password</text>
</g>

<!-- Entity proposition RMO -->
<g id="entity-proposition RMO">
	<g id="frame-proposition RMO">
		<rect x="440" y="724" width="172" height="30" fill="#80cdc1" stroke="#80cdc1" stroke-width="0"/>
		<rect x="440" y="754.0" width="172" height="64" fill="#c7eae5" stroke="#c7eae5" stroke-width="0"/>
		<rect x="440" y="724" width="172" height="94" fill="none" stroke="#35978f" stroke-width="1.5"/>
		<line x1="440" y1="754" x2="612" y2="754" stroke="#35978f" stroke-width="1.5"/>
	</g>
	<text x="448" y="745.3" fill="#000000" font-family="Copperplate" font-size="18">proposition RMO</text>
	<text x="448" y="771.1" fill="#000000" font-family="Gill Sans" font-size="15">id</text>
	<line x1="448" y1="774" x2="460" y2="774" stroke="#000000" stroke-width="1"/>
	<text x="448" y="788.1" fill="#000000" font-family="Gill Sans" font-size="15">libelle</text>
	<text x="448" y="805.0" fill="#000000" font-family="Gill Sans" font-size="15">ordre</text>
</g>

<!-- Entity association -->
<g id="entity-association">
	<g id="frame-association">
		<rect x="316" y="542" width="122" height="30" fill="#80cdc1" stroke="#80cdc1" stroke-width="0"/>
		<rect x="316" y="572.0" width="122" height="64" fill="#c7eae5" stroke="#c7eae5" stroke-width="0"/>
		<rect x="316" y="542" width="122" height="94" fill="none" stroke="#35978f" stroke-width="1.5"/>
		<line x1="316" y1="572" x2="438" y2="572" stroke="#35978f" stroke-width="1.5"/>
	</g>
	<text x="324" y="563.3" fill="#000000" font-family="Copperplate" font-size="18">association</text>
	<text x="324" y="589.1" fill="#000000" font-family="Gill Sans" font-size="15">id</text>
	<line x1="324" y1="592" x2="336" y2="592" stroke="#000000" stroke-width="1"/>
	<text x="324" y="606.1" fill="#000000" font-family="Gill Sans" font-size="15">proposition</text>
	<text x="324" y="623.0" fill="#000000" font-family="Gill Sans" font-size="15">complement</text>
</g>

<!-- Entity carte -->
<g id="entity-carte">
	<g id="frame-carte">
		<rect x="333" y="109" width="88" height="30" fill="#80cdc1" stroke="#80cdc1" stroke-width="0"/>
		<rect x="333" y="139.0" width="88" height="64" fill="#c7eae5" stroke="#c7eae5" stroke-width="0"/>
		<rect x="333" y="109" width="88" height="94" fill="none" stroke="#35978f" stroke-width="1.5"/>
		<line x1="333" y1="139" x2="421" y2="139" stroke="#35978f" stroke-width="1.5"/>
	</g>
	<text x="351" y="130.3" fill="#000000" font-family="Copperplate" font-size="18">carte</text>
	<text x="341" y="156.1" fill="#000000" font-family="Gill Sans" font-size="15">id</text>
	<line x1="341" y1="159" x2="353" y2="159" stroke="#000000" stroke-width="1"/>
	<text x="341" y="173.1" fill="#000000" font-family="Gill Sans" font-size="15">titre</text>
	<text x="341" y="190.0" fill="#000000" font-family="Gill Sans" font-size="15">intro_carte</text>
</g>

<!-- Entity Q bool -->
<g id="entity-Q bool">
	<g id="frame-Q bool">
		<rect x="188" y="542" width="80" height="30" fill="#80cdc1" stroke="#80cdc1" stroke-width="0"/>
		<rect x="188" y="572.0" width="80" height="64" fill="#c7eae5" stroke="#c7eae5" stroke-width="0"/>
		<rect x="188" y="542" width="80" height="94" fill="none" stroke="#35978f" stroke-width="1.5"/>
		<line x1="188" y1="572" x2="268" y2="572" stroke="#35978f" stroke-width="1.5"/>
	</g>
	<text x="196" y="563.3" fill="#000000" font-family="Copperplate" font-size="18">Q bool</text>
	<text x="196" y="589.1" fill="#000000" font-family="Gill Sans" font-size="15">id</text>
	<line x1="196" y1="592" x2="208" y2="592" stroke="#000000" stroke-width="1"/>
	<text x="196" y="606.1" fill="#000000" font-family="Gill Sans" font-size="15">libelle</text>
	<text x="196" y="623.0" fill="#000000" font-family="Gill Sans" font-size="15">reponse</text>
</g>
</svg>