nodexch1pa;chêne;1000;1000;25, 40, 60;gros, standard, luxe;0.007;0.011;chene.jpg
nodexch2pa;chêne;1000;1500;25, 40, 60;gros, standard, luxe;0.007;0.011;chene.jpg
nodexch1pf;chêne;1500;2000;25, 40, 60;gros, standard, luxe;0.007;0.011;chene.jpg
nodexch2pf;chêne;1500;3000;25, 40, 60;gros, standard;0.007;0.011;chene.jpg
nodexch1ga;chêne;5000;5000;25, 40, 60;gros;0.007;0.011;chene.jpg
nodexmr1pc;merisier;700;1000;15, 20, 30;luxe;0.014;0.043;merisier.jpg
nodexmr1pl;merisier;1000;1000;15, 20, 30;luxe;0.014;0.043;merisier.jpg
nodexmr2pl;merisier;1000;1400;15, 20, 30;luxe;0.014;0.043;merisier.jpg
nodexmr1gc;merisier;2000;2000;15, 20, 30;luxe;0.014;0.043;merisier.jpg
nodexmr2gc;merisier;2000;2800;15, 20, 30;luxe;0.014;0.043;merisier.jpg
nodexsa1pf;sapin;1500;1500;25, 40, 50, 65, 80;gros, standard;0.002;0.006;sapin.jpg
nodexsa2pf;sapin;1500;2000;25, 40, 50, 65, 80;gros, standard;0.002;0.006;sapin.jpg
nodexsa3pf;sapin;1500;2500;25, 40, 50, 65, 80;gros, standard;0.002;0.006;sapin.jpg
nodexsa1mf;sapin;3000;3000;25, 40, 50, 65, 80;gros;0.002;0.006;sapin.jpg
nodexsa2mf;sapin;3000;5000;25, 40, 50, 65, 80;gros;0.002;0.006;sapin.jpg
nodexfr1pv;frêne;1200;1200;20, 30, 40, 50;gros, standard;0.007;0.013;frene.jpg
nodexfr1mv;frêne;1800;1800;20, 30, 40, 50;gros, standard;0.007;0.013;frene.jpg
nodexfr2mv;frêne;1800;3600;20, 30, 40, 50;gros;0.007;0.013;frene.jpg
nodexmllib;mélaminé;0;0;10, 20, 30, 40, 50, 60, 70, 80;gros, standard;0;0.008;melamine.jpg
