[
    {
        "arguments": [
            "clang++",
            "-c",
            "-target",
            "armv7ar-none-none-eabi",
            "-fno-ms-extensions",
            "-fno-ms-compatibility",
            "-fno-delayed-template-parsing",
            "-isystemc:\\program files\\pros\\toolchain\\usr\\bin\\../lib/gcc/arm-none-eabi/10.2.1/../../../../arm-none-eabi/include/c++/10.2.1",
            "-isystemc:\\program files\\pros\\toolchain\\usr\\bin\\../lib/gcc/arm-none-eabi/10.2.1/../../../../arm-none-eabi/include/c++/10.2.1/arm-none-eabi/thumb/v7-a+simd/softfp",
            "-isystemc:\\program files\\pros\\toolchain\\usr\\bin\\../lib/gcc/arm-none-eabi/10.2.1/../../../../arm-none-eabi/include/c++/10.2.1/backward",
            "-isystemc:\\program files\\pros\\toolchain\\usr\\bin\\../lib/gcc/arm-none-eabi/10.2.1/include",
            "-isystemc:\\program files\\pros\\toolchain\\usr\\bin\\../lib/gcc/arm-none-eabi/10.2.1/include-fixed",
            "-isystemc:\\program files\\pros\\toolchain\\usr\\bin\\../lib/gcc/arm-none-eabi/10.2.1/../../../../arm-none-eabi/include",
            "-iquote./include",
            "-iquote./include/./",
            "-mcpu=cortex-a9",
            "-mfpu=neon-fp16",
            "-mfloat-abi=softfp",
            "-Os",
            "-g",
            "-D_POSIX_THREADS",
            "-D_UNIX98_THREAD_MUTEX_ATTRIBUTES",
            "-D_POSIX_TIMERS",
            "-D_POSIX_MONOTONIC_CLOCK",
            "-Wno-psabi",
            "-ffunction-sections",
            "-fdata-sections",
            "-fdiagnostics-color",
            "-funwind-tables",
            "--std=gnu++17",
            "-o",
            "bin/autons.cpp.o",
            "src\\autons.cpp"
        ],
        "directory": "C:\\Users\\sidda\\OneDrive\\Documents\\2023-2024-blacksmiths",
        "file": "src\\autons.cpp"
    },
    {
        "arguments": [
            "clang++",
            "-c",
            "-target",
            "armv7ar-none-none-eabi",
            "-fno-ms-extensions",
            "-fno-ms-compatibility",
            "-fno-delayed-template-parsing",
            "-isystemc:\\program files\\pros\\toolchain\\usr\\bin\\../lib/gcc/arm-none-eabi/10.2.1/../../../../arm-none-eabi/include/c++/10.2.1",
            "-isystemc:\\program files\\pros\\toolchain\\usr\\bin\\../lib/gcc/arm-none-eabi/10.2.1/../../../../arm-none-eabi/include/c++/10.2.1/arm-none-eabi/thumb/v7-a+simd/softfp",
            "-isystemc:\\program files\\pros\\toolchain\\usr\\bin\\../lib/gcc/arm-none-eabi/10.2.1/../../../../arm-none-eabi/include/c++/10.2.1/backward",
            "-isystemc:\\program files\\pros\\toolchain\\usr\\bin\\../lib/gcc/arm-none-eabi/10.2.1/include",
            "-isystemc:\\program files\\pros\\toolchain\\usr\\bin\\../lib/gcc/arm-none-eabi/10.2.1/include-fixed",
            "-isystemc:\\program files\\pros\\toolchain\\usr\\bin\\../lib/gcc/arm-none-eabi/10.2.1/../../../../arm-none-eabi/include",
            "-iquote./include",
            "-iquote./include/./",
            "-mcpu=cortex-a9",
            "-mfpu=neon-fp16",
            "-mfloat-abi=softfp",
            "-Os",
            "-g",
            "-D_POSIX_THREADS",
            "-D_UNIX98_THREAD_MUTEX_ATTRIBUTES",
            "-D_POSIX_TIMERS",
            "-D_POSIX_MONOTONIC_CLOCK",
            "-Wno-psabi",
            "-ffunction-sections",
            "-fdata-sections",
            "-fdiagnostics-color",
            "-funwind-tables",
            "--std=gnu++17",
            "-o",
            "bin/main.cpp.o",
            "src\\main.cpp"
        ],
        "directory": "C:\\Users\\sidda\\OneDrive\\Documents\\2023-2024-blacksmiths",
        "file": "src\\main.cpp"
    },
    {
        "arguments": [
            "clang++",
            "-c",
            "-target",
            "armv7ar-none-none-eabi",
            "-fno-ms-extensions",
            "-fno-ms-compatibility",
            "-fno-delayed-template-parsing",
            "-isystemc:\\program files\\pros\\toolchain\\usr\\bin\\../lib/gcc/arm-none-eabi/10.2.1/../../../../arm-none-eabi/include/c++/10.2.1",
            "-isystemc:\\program files\\pros\\toolchain\\usr\\bin\\../lib/gcc/arm-none-eabi/10.2.1/../../../../arm-none-eabi/include/c++/10.2.1/arm-none-eabi/thumb/v7-a+simd/softfp",
            "-isystemc:\\program files\\pros\\toolchain\\usr\\bin\\../lib/gcc/arm-none-eabi/10.2.1/../../../../arm-none-eabi/include/c++/10.2.1/backward",
            "-isystemc:\\program files\\pros\\toolchain\\usr\\bin\\../lib/gcc/arm-none-eabi/10.2.1/include",
            "-isystemc:\\program files\\pros\\toolchain\\usr\\bin\\../lib/gcc/arm-none-eabi/10.2.1/include-fixed",
            "-isystemc:\\program files\\pros\\toolchain\\usr\\bin\\../lib/gcc/arm-none-eabi/10.2.1/../../../../arm-none-eabi/include",
            "-iquote./include",
            "-iquote./include/./",
            "-mcpu=cortex-a9",
            "-mfpu=neon-fp16",
            "-mfloat-abi=softfp",
            "-Os",
            "-g",
            "-D_POSIX_THREADS",
            "-D_UNIX98_THREAD_MUTEX_ATTRIBUTES",
            "-D_POSIX_TIMERS",
            "-D_POSIX_MONOTONIC_CLOCK",
            "-Wno-psabi",
            "-ffunction-sections",
            "-fdata-sections",
            "-fdiagnostics-color",
            "-funwind-tables",
            "--std=gnu++17",
            "-o",
            "bin/main.cpp.o",
            "src\\main.cpp"
        ],
        "directory": "C:\\Users\\sidda\\OneDrive\\Documents\\idkStates\\2023-2024-blacksmiths",
        "file": "src\\main.cpp"
    },
    {
        "arguments": [
            "clang++",
            "-c",
            "-target",
            "armv7ar-none-none-eabi",
            "-fno-ms-extensions",
            "-fno-ms-compatibility",
            "-fno-delayed-template-parsing",
            "-isystemc:\\program files\\pros\\toolchain\\usr\\bin\\../lib/gcc/arm-none-eabi/10.2.1/../../../../arm-none-eabi/include/c++/10.2.1",
            "-isystemc:\\program files\\pros\\toolchain\\usr\\bin\\../lib/gcc/arm-none-eabi/10.2.1/../../../../arm-none-eabi/include/c++/10.2.1/arm-none-eabi/thumb/v7-a+simd/softfp",
            "-isystemc:\\program files\\pros\\toolchain\\usr\\bin\\../lib/gcc/arm-none-eabi/10.2.1/../../../../arm-none-eabi/include/c++/10.2.1/backward",
            "-isystemc:\\program files\\pros\\toolchain\\usr\\bin\\../lib/gcc/arm-none-eabi/10.2.1/include",
            "-isystemc:\\program files\\pros\\toolchain\\usr\\bin\\../lib/gcc/arm-none-eabi/10.2.1/include-fixed",
            "-isystemc:\\program files\\pros\\toolchain\\usr\\bin\\../lib/gcc/arm-none-eabi/10.2.1/../../../../arm-none-eabi/include",
            "-iquote./include",
            "-iquote./include/./",
            "-mcpu=cortex-a9",
            "-mfpu=neon-fp16",
            "-mfloat-abi=softfp",
            "-Os",
            "-g",
            "-D_POSIX_THREADS",
            "-D_UNIX98_THREAD_MUTEX_ATTRIBUTES",
            "-D_POSIX_TIMERS",
            "-D_POSIX_MONOTONIC_CLOCK",
            "-Wno-psabi",
            "-ffunction-sections",
            "-fdata-sections",
            "-fdiagnostics-color",
            "-funwind-tables",
            "--std=gnu++17",
            "-o",
            "bin/autons.cpp.o",
            "src\\autons.cpp"
        ],
        "directory": "C:\\Users\\sidda\\OneDrive\\Documents\\idkStates\\2023-2024-blacksmiths",
        "file": "src\\autons.cpp"
    }
]