<svg width="210" height="41" viewBox="0 0 210 41" fill="none" xmlns="http://www.w3.org/2000/svg">
<path fill-rule="evenodd" clip-rule="evenodd" d="M42.3462 28.7705C40.3129 32.6794 37.0939 37.739 32.3293 37.739C28.5923 37.739 25.3713 36.2894 23.5823 32.8122C22.5481 34.9494 21.2027 36.8892 18.8446 37.4476C18.5563 37.5057 18.2106 37.5644 17.8074 37.5644C16.0208 37.5644 12.9088 36.9817 11.6988 33.7205C10.6037 35.06 9.50905 36.6903 7.72248 36.9817C7.2039 37.0402 6.80022 37.0983 6.5699 37.0983C3.97648 37.0983 1.32612 35.2928 0.576719 32.7885C-0.518403 29.0613 0.000673469 24.868 1.67183 21.3736C3.22759 18.1124 6.05132 15.8994 9.68191 15.8994C11.5259 15.8994 12.6785 17.5298 13.8311 18.7532C13.8885 17.297 14.7528 16.5982 16.3091 16.5982C17.9223 16.7729 18.6142 17.6464 18.5563 18.5785C18.3834 21.4322 16.7123 28.3044 16.7123 33.2544C16.7697 34.2446 16.8851 35.3513 17.8074 35.526C18.8446 35.526 19.7089 35.1181 20.4583 34.3613C21.5224 33.2459 22.1549 31.7766 22.7439 30.3088C22.1509 27.0038 23.3929 23.5174 25.1835 20.7328C26.6818 18.3451 28.8141 17.1223 31.5804 17.1223C32.3872 17.1223 33.1361 17.2389 33.7701 17.5297C36.1327 18.4037 37.1124 21.3155 36.8821 23.7032C36.8821 24.4606 36.4784 24.8681 35.6141 24.8681C34.9801 24.8681 34.6344 24.6353 34.577 24.1112C34.4041 22.7717 34.1733 19.8013 32.3872 19.8013C31.8107 19.8013 31.4075 19.976 31.1767 20.3835C29.3327 23.5871 28.4109 27.1976 28.8141 30.8668C29.2173 33.6038 30.4278 35.7587 32.5601 35.7587C35.9538 35.7587 39.3586 30.2897 40.8329 27.3991C40.5777 27.1426 40.3259 26.8831 40.0796 26.6175C39.525 26.0065 39.0404 25.33 38.6407 24.608C38.3609 24.1132 38.1361 23.5981 37.9662 23.0579C37.7764 22.4722 37.6765 21.8614 37.6715 21.2454C37.6765 20.3214 37.9263 19.4126 38.4059 18.625C38.9854 17.6959 39.8148 16.9587 40.799 16.4992C41.8731 15.9994 43.0422 15.7469 44.2212 15.7621C44.461 15.7621 44.6958 15.7722 44.9356 15.7873C46.1697 15.8934 47.3637 16.2867 48.4279 16.9284C49.3171 17.4788 50.1115 18.1655 50.786 18.9683C51.6453 17.9887 52.6844 17.1809 53.8435 16.5851C54.528 16.2317 55.2474 15.9539 55.9918 15.7621C56.7262 15.5702 57.4806 15.4744 58.24 15.4693C58.8945 15.4693 59.5489 15.545 60.1884 15.7015C62.1569 16.1711 63.8055 17.5342 64.6498 19.3923C64.7767 19.6715 64.8842 19.9579 64.9681 20.2507C65.0445 19.8312 65.127 19.409 65.2144 18.9859C66.5398 13.3951 67.4616 7.62916 70.2853 2.73715C71.1496 1.33958 72.9942 0.232852 74.6653 0.232852C75.5296 0.232852 76.1636 0.466011 76.6822 0.931531C79.448 3.95994 79.1023 9.20185 76.7971 12.6963C75.3568 15.2001 73.1091 16.8895 71.265 18.9278C70.1704 23.1791 69.8821 27.7799 71.0922 31.9731C71.4959 33.3126 72.6479 35.0599 74.0888 35.0599C74.7228 35.0599 75.3568 34.7106 75.9908 34.0699C77.6654 32.2744 78.8934 29.3944 79.8367 27.1708C80.4677 19.0858 80.7145 13.7142 83.9429 5.53273C85.038 2.97035 87.4586 0 90.4552 0C92.7024 0 94.8921 1.3396 95.6415 3.43595C96.7941 5.82414 96.0447 8.5612 94.7193 10.7161C92.9332 13.686 89.994 15.6081 86.9395 17.1804C86.5363 20.8495 86.306 24.344 86.0177 28.0131C88.0346 23.6452 90.4552 19.4519 94.2007 16.4816C94.8346 15.9575 95.584 15.7242 96.5638 15.7242C98.4078 15.7242 100.252 16.831 100.079 18.8693C100.079 24.2859 95.6989 33.2545 98.0041 36.3409C98.2344 36.5156 98.5227 36.6322 98.811 36.6322C100.822 36.6322 103.043 31.61 104.055 29.0203C104.064 26.8841 104.762 24.6176 105.726 22.597C107.628 18.6365 111.201 16.1903 115.581 16.1903C118.75 16.2489 122.438 18.9278 121.343 22.4217C120.248 25.6834 116.963 27.081 113.737 27.081C112.814 27.081 111.892 26.9649 111.028 26.7316C110.855 29.5273 111.086 33.0798 112.93 34.7687C113.564 35.4094 114.255 35.7002 115.004 35.7002C115.811 35.7002 116.791 35.3513 117.886 34.594C118.52 34.0699 119.038 33.4873 119.672 32.847C120.89 31.4838 121.944 29.8883 122.828 28.5352C122.904 28.2337 122.986 27.9434 123.072 27.6637C124.455 22.8297 124.801 19.976 124.801 18.2871C124.801 17.297 124.686 16.5397 124.455 16.0742C125.204 15.5501 126.011 15.2588 126.76 15.2588C127.913 15.2588 128.719 15.8409 129.123 17.0643C130.045 19.8013 129.642 22.713 129.584 25.5087C131.831 22.189 133.791 18.6365 137.018 16.2489C137.709 15.6662 138.632 15.3754 139.726 15.3754C140.879 15.3754 142.031 15.8409 142.435 17.0643C143.299 20.6168 141.686 22.189 141.513 25.7415C141.455 26.7317 142.32 26.9063 142.781 26.9063C144.106 26.9063 146.18 23.6452 146.872 22.5384C147.045 22.2471 147.448 21.5483 147.621 21.3736C147.794 21.2569 147.967 21.1989 148.14 21.1989C148.659 21.1989 148.889 21.4322 148.889 21.9563C148.889 22.3637 148.255 23.1211 148.025 23.5285C147.16 24.9261 145.547 27.489 143.76 28.1878C143.357 28.3625 142.608 28.77 141.513 28.8285C134.943 28.8285 136.442 21.3155 136.73 19.9179C133.214 24.7513 129.526 29.5853 127.971 35.4675C127.74 36.8655 126.587 37.6224 125.262 37.6224C124.57 37.6224 123.994 37.4477 123.533 37.1563C122.402 35.8441 122.154 34.2855 122.22 32.6587C121.244 33.879 120.165 35.0276 119.038 35.8754C117.309 37.4476 115.292 38.2045 113.045 38.2045C109.818 38.2045 106.648 36.4576 104.862 32.7304C104.822 32.6542 104.784 32.5769 104.746 32.5002C103.334 35.7967 101.115 39.6026 98.0616 39.6026C97.8887 39.6026 97.6584 39.544 97.2552 39.486C94.4315 39.1946 92.4141 36.4576 91.3195 33.9532C89.9366 29.76 91.0887 25.4506 92.5295 21.4321C90.0515 24.9846 88.0921 28.6538 86.7092 32.3229C86.1906 33.7205 85.614 35.2928 84.404 36.2829C83.77 36.6903 82.9637 36.9236 82.0989 36.9236C81.2925 36.9236 80.6006 36.7489 79.9671 36.3409C78.8719 35.2347 79.3905 33.6039 79.3905 32.2644C79.3925 32.2452 79.3945 32.2259 79.3955 32.2088C79.0183 32.9131 78.6306 33.5892 78.238 34.2445C76.7971 36.6322 75.126 37.7971 73.1091 37.7971C70.5736 37.7971 68.0381 35.8168 66.1941 33.3125C64.7098 31.3247 64.2387 28.5846 64.3561 25.5002C64.3146 25.5724 64.2707 25.6435 64.2252 25.7137C63.8305 26.3145 63.3659 26.875 62.8463 27.3748C62.3267 27.8696 61.7722 28.324 61.1876 28.7381C60.6031 29.147 59.9936 29.5358 59.3741 29.8892C58.7596 30.2477 58.1401 30.5911 57.5156 30.9294L57.5056 30.9395C57.5006 30.9395 57.5006 30.9395 57.5006 30.9395C56.8711 31.2828 56.2466 31.6312 55.6221 31.9897C55.0276 32.3381 54.448 32.7117 53.8885 33.1156C53.6786 33.2621 53.4788 33.4185 53.284 33.5801C53.289 33.5852 53.294 33.5902 53.299 33.5953C53.4588 33.7972 53.6137 33.9941 53.7586 34.2011C53.8835 34.3728 54.0034 34.5445 54.1233 34.7161C54.1882 34.807 54.2532 34.903 54.3131 35.004C54.463 35.2867 54.5829 35.5897 54.6729 35.9027C54.7878 36.2763 54.8477 36.6701 54.8527 37.0639C54.8577 37.3971 54.7977 37.7355 54.6778 38.0486C54.478 38.5535 54.0833 38.9574 53.5837 39.1644C53.3189 39.2754 53.0392 39.331 52.7594 39.331C52.4646 39.331 52.1749 39.2704 51.9051 39.1644C51.6503 39.0634 51.4055 38.927 51.1856 38.7655C50.781 38.4726 50.4213 38.1293 50.1065 37.7456C49.8067 37.3921 49.562 36.9932 49.3821 36.564C49.2122 36.1601 49.1223 35.721 49.1223 35.2766C49.1323 34.8222 49.2222 34.3728 49.3921 33.9487C48.9324 33.5902 48.4728 33.2369 47.9982 32.8935C47.3937 32.4593 46.7842 32.0251 46.1697 31.6009V31.5959H46.1647C45.0955 30.8587 44.0414 30.0912 43.0122 29.2985C42.7879 29.1254 42.5666 28.9487 42.3462 28.7705ZM11.6988 28.1878C11.448 29.8247 10.143 31.9149 8.58679 33.4872C8.29852 33.7785 8.01075 33.8952 7.66503 33.8952C7.03104 33.8952 6.56991 33.6039 6.39705 32.9632C5.24447 29.1779 5.7056 25.0427 6.91563 21.3155C7.2039 20.5001 7.72248 19.5686 8.47188 18.5199C8.75965 18.1705 9.10538 17.9958 9.50906 17.9958C9.97019 17.9958 10.3159 18.1705 10.5462 18.4619C11.1802 19.2187 11.5834 19.9179 11.7562 20.6748C12.6211 23.1791 11.9871 25.6835 11.6988 28.1878ZM74.9531 3.14504C75.7669 3.39144 75.9223 4.54875 75.9908 5.00872C76.6103 8.85861 74.4345 12.9871 71.9565 15.9574C72.8788 11.7062 74.398 3.29197 74.4405 3.14504C74.4688 3.04675 74.6397 3.04675 74.9531 3.14504ZM90.2243 3.02843C90.3812 2.65177 90.8583 2.0969 91.4923 2.0969C91.9534 2.0969 92.3566 2.27113 92.6449 2.67909C93.5092 3.78533 93.9129 4.95008 93.7975 6.28959C93.3938 10.3081 90.2823 13.2204 87.2277 15.4915C88.15 11.2983 88.5532 6.98839 90.2243 3.02843ZM116.099 18.4619C116.618 18.4619 117.021 18.6365 117.425 18.9859C118.174 19.6266 118.52 20.3254 118.462 21.1408C118.462 23.7613 116.099 25.6254 113.621 25.6254C112.814 25.6254 112.065 25.4507 111.431 25.0427C111.892 23.4124 114.082 18.4619 116.099 18.4619ZM198.769 17.8105C199.287 17.8105 199.691 17.9851 200.094 18.3345C200.843 18.9753 201.189 19.6741 201.131 20.4895C201.131 23.1104 198.769 24.9741 196.291 24.9741C195.484 24.9741 194.735 24.7994 194.101 24.3914C194.562 22.7611 196.752 17.8105 198.769 17.8105ZM142.714 34.0501C142.714 31.3716 144.866 29.1971 147.516 29.1971C150.166 29.1971 152.318 31.3716 152.318 34.0501C152.318 36.7291 150.166 38.9038 147.516 38.9038C144.866 38.9038 142.714 36.7291 142.714 34.0501ZM187.295 31.566C186.866 32.6319 186.384 33.6771 185.803 34.7C184.938 36.2723 183.67 39.0679 181.884 39.8247C181.596 39.9413 181.308 40 181.02 40C179.464 40 177.389 38.9512 176.64 37.379C173.874 32.487 177.101 24.3914 177.85 18.1599C177.827 18.177 177.805 18.1947 177.782 18.2119C177.759 18.2291 173.459 23.0791 172.145 26.2554C171.05 29.5166 171.569 32.9531 170.359 36.1562C169.725 37.321 168.745 37.9031 167.419 37.9031C165.633 37.9031 163.731 36.6217 163.904 34.3507C164.307 29.1673 165.806 24.3334 166.728 19.2667C164.135 22.5279 162.175 26.2556 160.792 30.3902C160.158 32.1957 160.101 34.4087 158.545 35.5735C158.026 35.7482 157.565 35.8647 157.047 35.8647C155.663 35.8647 154.742 35.2821 154.338 34.1173C153.589 32.021 154.165 29.6914 154.453 27.595C155.318 23.8673 155.894 20.0821 157.335 16.879C157.623 16.1802 158.199 15.8302 159.064 15.8302C160.043 15.8302 160.735 16.1215 161.253 16.7623C161.887 17.869 161.023 21.0722 161.195 23.3433C162.406 21.0722 165.633 15.4814 168.629 15.4814C169.84 15.4814 170.704 15.9469 171.338 16.879C171.972 18.1019 171.972 19.4413 172.26 20.7808C173.586 18.7425 175.199 16.6457 177.562 16.4129C177.965 16.3549 178.253 16.2963 178.484 16.2963C180.328 16.2963 182.287 17.5196 181.999 19.7907C181.538 25.0321 178.542 35.2241 181.077 37.1457C181.25 37.2043 181.365 37.2624 181.423 37.2624C182.057 37.2624 182.46 36.5056 182.864 35.9815C184.562 33.4075 185.673 30.5371 186.739 27.6894C186.884 25.7561 187.534 23.7527 188.396 21.9457C190.298 17.9852 193.87 15.5394 198.25 15.5394C201.42 15.5975 205.108 18.2765 204.013 21.771C202.918 25.0322 199.633 26.4302 196.406 26.4302C195.484 26.4302 194.562 26.3135 193.697 26.0808C193.525 28.8759 193.755 32.4284 195.599 34.1173C196.233 34.758 196.925 35.0493 197.674 35.0493C198.481 35.0493 199.46 34.7 200.555 33.9426C201.189 33.4186 201.707 32.8364 202.341 32.1957C203.955 30.3902 205.281 28.1772 206.26 26.721C206.433 26.4302 206.663 26.3135 206.952 26.3135C207.643 26.3135 208.277 27.0123 207.874 27.7111C206.433 30.0407 204.186 33.3605 201.707 35.2241C199.979 36.7964 197.962 37.5538 195.714 37.5538C192.487 37.5538 189.318 35.8063 187.531 32.0791C187.443 31.9115 187.363 31.7407 187.295 31.566ZM57.6305 19.1096C58.1001 19.1349 58.5597 19.251 58.9844 19.4428C59.3541 19.6195 59.6938 19.8669 59.9736 20.1699C60.2634 20.493 60.4982 20.8566 60.668 21.2555C60.8579 21.6998 60.9928 22.1643 61.0627 22.644C61.1127 22.952 61.1377 23.2649 61.1377 23.578C61.1477 24.0627 61.0527 24.5474 60.8629 24.9917C60.678 25.3906 60.4232 25.7441 60.1035 26.0369C59.7138 26.3903 59.2891 26.6984 58.8345 26.9609C58.28 27.284 57.7154 27.592 57.1459 27.8848C56.7612 28.0817 56.3815 28.2836 55.9968 28.4907L55.9918 28.4957C55.3423 28.839 54.7028 29.2026 54.0683 29.5763C53.4988 29.9146 52.9442 30.273 52.4047 30.6517C51.95 30.9647 51.5204 31.308 51.1107 31.6817C50.1515 30.9445 49.1723 30.2326 48.1781 29.551L48.1731 29.5459H48.1681C47.4636 29.0562 46.7592 28.5564 46.0647 28.0464C45.3753 27.5415 44.7058 27.0114 44.0564 26.456C43.5068 25.9864 42.9822 25.4865 42.4876 24.9614C42.0879 24.5373 41.7232 24.0829 41.3985 23.6032C41.1437 23.2296 40.9339 22.8257 40.779 22.4016C40.6541 22.0734 40.5891 21.725 40.5891 21.3716C40.5891 21.0737 40.6441 20.7809 40.749 20.5032C40.9938 19.9175 41.4235 19.4328 41.968 19.1197C42.5925 18.7461 43.312 18.5542 44.0364 18.5593L44.4211 18.5744C45.4352 18.6552 46.4095 19.0086 47.2438 19.5943C48.1381 20.2356 48.8675 21.0837 49.3771 22.0683C49.492 22.3056 49.6569 22.5075 49.8617 22.6742C50.0865 22.8458 50.3663 22.9418 50.6511 22.9367C50.8159 22.9266 50.9758 22.861 51.1007 22.75C51.1607 22.6995 51.2156 22.6439 51.2706 22.5884C51.3955 22.447 51.5204 22.3057 51.6403 22.1593C51.9251 21.8058 52.2248 21.4676 52.5346 21.1444C52.8943 20.7708 53.299 20.4425 53.7336 20.1598C54.8477 19.468 56.1317 19.1046 57.4406 19.1096H57.6305Z" fill="#4B45BD"/>
</svg>
