id,name,model_id:id,group_id:id,perm_read,perm_write,perm_create,perm_unlink
access_purchase_dashboard,purchase_dashboard,model_purchase_dashboard,purchase_extension.group_mrs_mrs,1,1,1,0
access_dashboard_widget_master,dashboard_widget_master,model_dashboard_widget_master,purchase_extension.group_mrs_mrs,1,1,1,0
access_widget_master_line,widget_master_line,model_widget_master_line,purchase_extension.group_mrs_mrs,1,1,1,0
access_widget_master_filter_line,widget_master_filter_line,model_widget_master_filter_line,purchase_extension.group_mrs_mrs,1,1,1,0
access_purchase_dashboard_report,purchase_dashboard_report,model_purchase_dashboard_report,purchase_extension.group_mrs_mrs,1,1,1,0