[
    {
        "model": "auth.user",
        "pk": 1,
        "fields": {
            "password": "pbkdf2_sha256$120000$v9KSa8Ndy9hu$u60BDlK8XPrBWfbQ8HXDzGqMAxjW2hR/b+BMPraCwQI=",
            "last_login": null,
            "is_superuser": false,
            "username": "user_a",
            "first_name": "",
            "last_name": "",
            "email": "user_a@bar.com",
            "is_staff": false,
            "is_active": true,
            "date_joined": "2020-01-22T12:41:45.972Z",
            "groups": [],
            "user_permissions": []
        }
    },
    {
        "model": "auth.user",
        "pk": 2,
        "fields": {
            "password": "pbkdf2_sha256$120000$MsbODI3phRSR$JwH9LxkDLnqpaFZBiAeWvsRssJbbedldhRi5/Jkh88k=",
            "last_login": null,
            "is_superuser": false,
            "username": "user_b",
            "first_name": "",
            "last_name": "",
            "email": "user_b@bar.com",
            "is_staff": false,
            "is_active": true,
            "date_joined": "2020-01-22T12:41:55.012Z",
            "groups": [],
            "user_permissions": []
        }
    },
    {
        "model": "auth.user",
        "pk": 3,
        "fields": {
            "password": "pbkdf2_sha256$120000$nveESx6T33nn$+SSpwlTw93ijI9WETspDkkSIkj6CjkxEt2cbdntYZKQ=",
            "last_login": null,
            "is_superuser": true,
            "username": "admin_a",
            "first_name": "",
            "last_name": "",
            "email": "admin_a@bar.com",
            "is_staff": true,
            "is_active": true,
            "date_joined": "2020-01-22T12:42:31.070Z",
            "groups": [],
            "user_permissions": []
        }
    },
    {
        "model": "auth.user",
        "pk": 4,
        "fields": {
            "password": "pbkdf2_sha256$120000$0Nsj3Mcof4wC$7bbOKXVCtHKLxlThvlbtBHzmb60rFb0xEX0jr23yjyc=",
            "last_login": null,
            "is_superuser": true,
            "username": "admin_b",
            "first_name": "",
            "last_name": "",
            "email": "admin_b@bar.com",
            "is_staff": true,
            "is_active": true,
            "date_joined": "2020-01-22T12:42:39.047Z",
            "groups": [],
            "user_permissions": []
        }
    }
]