{
    "openapi": "3.0.0",
    "info": {
        "title": "Smart Data API",
        "version": "1.0_beta"
    },
    "paths": {
        "/plti_smart_data/dataapi/public/api/auth/register": {
            "post": {
                "tags": [
                    "Authentication"
                ],
                "summary": "Register user baru",
                "operationId": "41a86bb203de6a4f76e155c87b5a86a6",
                "requestBody": {
                    "content": {
                        "application/json": {
                            "schema": {
                                "properties": {
                                    "email": {
                                        "type": "string"
                                    },
                                    "name": {
                                        "type": "string"
                                    },
                                    "password": {
                                        "type": "string"
                                    }
                                },
                                "type": "object",
                                "example": {
                                    "email": "kurnianto@gmail.com",
                                    "name": "Achmad Kurnianto",
                                    "password": "secret123"
                                }
                            }
                        }
                    }
                },
                "responses": {
                    "200": {
                        "description": "OK"
                    }
                }
            }
        },
        "/plti_smart_data/dataapi/public/api/auth/login": {
            "post": {
                "tags": [
                    "Authentication"
                ],
                "summary": "Login untuk mendapatkan token",
                "operationId": "9218c29755b53354e72d00081f5292e7",
                "requestBody": {
                    "content": {
                        "application/json": {
                            "schema": {
                                "properties": {
                                    "email": {
                                        "type": "string"
                                    },
                                    "password": {
                                        "type": "string"
                                    }
                                },
                                "type": "object",
                                "example": {
                                    "email": "kurnianto@gmail.com",
                                    "password": "secret123"
                                }
                            }
                        }
                    }
                },
                "responses": {
                    "200": {
                        "description": "OK"
                    }
                }
            }
        },
        "/plti_smart_data/dataapi/public/api/blockchain/data": {
            "get": {
                "tags": [
                    "Data Blockchain"
                ],
                "summary": "Return list of type data",
                "description": "An API to get list of type data",
                "operationId": "e1ffca05547d5f590547807b1ab58f37",
                "responses": {
                    "default": {
                        "description": "List of data types"
                    }
                },
                "security": [
                    {
                        "authentication": []
                    }
                ]
            },
            "post": {
                "tags": [
                    "Data Blockchain"
                ],
                "summary": "Return data",
                "description": "API untuk memasukkan data blockchain dengan format data_cell json array dengan key row_key dan data_value",
                "operationId": "d4923c14ace263ba8c80b59b02065a7c",
                "requestBody": {
                    "content": {
                        "application/json": {
                            "schema": {
                                "example": {
                                    "id_title": "1",
                                    "id_data_series": "1",
                                    "id_time_period_value": "2",
                                    "id_data": "1",
                                    "id_series": "1",
                                    "id_issuer": "23",
                                    "data_cell": [
                                        {
                                            "row_key": 11,
                                            "data_value": "1"
                                        },
                                        {
                                            "row_key": 11,
                                            "data_value": "2"
                                        }
                                    ]
                                }
                            }
                        }
                    }
                },
                "responses": {
                    "default": {
                        "description": "List data cell "
                    }
                },
                "security": [
                    {
                        "authentication": []
                    }
                ]
            }
        },
        "/plti_smart_data/dataapi/public/api/blockchain/data/title": {
            "get": {
                "tags": [
                    "Data Blockchain"
                ],
                "summary": "Return judul data",
                "description": "API untuk mendapatkan judul data",
                "operationId": "7c4045ff0d633374e11b656679c5ac50",
                "parameters": [
                    {
                        "name": "search",
                        "in": "query",
                        "description": "Judul data",
                        "schema": {
                            "type": "string"
                        }
                    }
                ],
                "responses": {
                    "default": {
                        "description": "List judul data"
                    }
                },
                "security": [
                    {
                        "authentication": []
                    }
                ]
            }
        },
        "/plti_smart_data/dataapi/public/api/blockchain/data/title/detail/{id_title}": {
            "get": {
                "tags": [
                    "Data Blockchain"
                ],
                "summary": "Return judul data",
                "description": "API untuk mendapatkan judul data",
                "operationId": "eabea5b2b6f39640bb2dac6881a46508",
                "parameters": [
                    {
                        "name": "id_title",
                        "in": "path",
                        "description": "id title",
                        "schema": {
                            "type": "string"
                        }
                    }
                ],
                "responses": {
                    "default": {
                        "description": "Detail judul data"
                    }
                },
                "security": [
                    {
                        "authentication": []
                    }
                ]
            }
        },
        "/plti_smart_data/dataapi/public/api/blockchain/data/series/{id_data}": {
            "get": {
                "tags": [
                    "Data Blockchain"
                ],
                "summary": "Return data",
                "description": "API untuk mendapatkan data",
                "operationId": "e20ca3313572d3dba638d70f7af0a359",
                "parameters": [
                    {
                        "name": "id_data",
                        "in": "path",
                        "description": "Id data",
                        "schema": {
                            "type": "string"
                        }
                    }
                ],
                "responses": {
                    "default": {
                        "description": "List series data"
                    }
                },
                "security": [
                    {
                        "authentication": []
                    }
                ]
            }
        },
        "/plti_smart_data/dataapi/public/api/blockchain/data/cell/{id_series}": {
            "get": {
                "tags": [
                    "Data Blockchain"
                ],
                "summary": "Return data",
                "description": "API untuk mendapatkan data cell",
                "operationId": "03d5c8217213f344e7fe66f28072a212",
                "parameters": [
                    {
                        "name": "id_series",
                        "in": "path",
                        "description": "Id data",
                        "schema": {
                            "type": "string"
                        }
                    }
                ],
                "responses": {
                    "default": {
                        "description": "List data cell "
                    }
                },
                "security": [
                    {
                        "authentication": []
                    }
                ]
            }
        },
        "/plti_smart_data/dataapi/public/api/data": {
            "get": {
                "tags": [
                    "Data"
                ],
                "summary": "Return list of type data",
                "description": "An API to get list of type data",
                "operationId": "575eee8d7f82e7e0f5d49cd215adeb13",
                "responses": {
                    "default": {
                        "description": "List of data types"
                    }
                },
                "security": [
                    {
                        "authentication": []
                    }
                ]
            }
        },
        "/plti_smart_data/dataapi/public/api/data/title": {
            "get": {
                "tags": [
                    "Data"
                ],
                "summary": "Return judul data",
                "description": "API untuk mendapatkan judul data",
                "operationId": "554fbe43907774c830dfe0d07b4aab08",
                "parameters": [
                    {
                        "name": "search",
                        "in": "query",
                        "description": "Judul data",
                        "schema": {
                            "type": "string"
                        }
                    }
                ],
                "responses": {
                    "default": {
                        "description": "List judul data"
                    }
                },
                "security": [
                    {
                        "authentication": []
                    }
                ]
            }
        },
        "/plti_smart_data/dataapi/public/api/data/title/detail/{id_title}": {
            "get": {
                "tags": [
                    "Data"
                ],
                "summary": "Return judul data",
                "description": "API untuk mendapatkan judul data",
                "operationId": "2486330becaf335822a87511df6dc8ed",
                "parameters": [
                    {
                        "name": "id_title",
                        "in": "path",
                        "description": "id title",
                        "schema": {
                            "type": "string"
                        }
                    }
                ],
                "responses": {
                    "default": {
                        "description": "Detail judul data"
                    }
                },
                "security": [
                    {
                        "authentication": []
                    }
                ]
            }
        },
        "/plti_smart_data/dataapi/public/api/data/series/{id_data}": {
            "get": {
                "tags": [
                    "Data"
                ],
                "summary": "Return data",
                "description": "API untuk mendapatkan data",
                "operationId": "e2c464cb513d38383a8a0c53f9a7a2da",
                "parameters": [
                    {
                        "name": "id_data",
                        "in": "path",
                        "description": "Id data",
                        "schema": {
                            "type": "string"
                        }
                    }
                ],
                "responses": {
                    "default": {
                        "description": "List series data"
                    }
                },
                "security": [
                    {
                        "authentication": []
                    }
                ]
            }
        },
        "/plti_smart_data/dataapi/public/api/data/cell/{id_series}": {
            "get": {
                "tags": [
                    "Data"
                ],
                "summary": "Return data",
                "description": "API untuk mendapatkan data cell",
                "operationId": "5310e8a3e4c2ab4b98522216893ca032",
                "parameters": [
                    {
                        "name": "id_series",
                        "in": "path",
                        "description": "Id data",
                        "schema": {
                            "type": "string"
                        }
                    }
                ],
                "responses": {
                    "default": {
                        "description": "List data cell "
                    }
                },
                "security": [
                    {
                        "authentication": []
                    }
                ]
            }
        },
        "/api/master/wilayah/provinsi": {
            "get": {
                "tags": [
                    "Master Wilayah"
                ],
                "summary": "Return list provinsi",
                "description": "API untuk mendapatkan daftar provinsi",
                "operationId": "034ad6c44b7febfb89910c66661fdc45",
                "responses": {
                    "default": {
                        "description": "List master provinsi"
                    }
                },
                "security": [
                    {
                        "authentication": []
                    }
                ]
            }
        },
        "/api/master/wilayah/kabkot/{idparent}": {
            "get": {
                "tags": [
                    "Master Wilayah"
                ],
                "summary": "Return list kabupaten/kota",
                "description": "API untuk mendapatkan daftar kabupaten/kota",
                "operationId": "d2f5f1ce6840d3c8968ff1106fad4532",
                "parameters": [
                    {
                        "name": "idparent",
                        "in": "path",
                        "description": "Id Parent wilayah (Id provinsi)",
                        "schema": {
                            "type": "int"
                        },
                        "examples": {
                            "int": {
                                "summary": "Provinsi Aceh",
                                "value": "11"
                            }
                        }
                    }
                ],
                "responses": {
                    "default": {
                        "description": "List master kabupaten kota"
                    }
                },
                "security": [
                    {
                        "authentication": []
                    }
                ]
            }
        }
    },
    "components": {
        "securitySchemes": {
            "authentication": {
                "type": "http",
                "description": "Authentication key",
                "scheme": "bearer",
                "in": "header"
            }
        }
    },
    "security": [
        []
    ]
}