<?xml version="1.0" encoding="UTF-8" standalone="no"?>
<!-- Created with Inkscape (http://www.inkscape.org/) -->

<svg
   version="1.1"
   id="svg678"
   width="1139.8416"
   height="585.11163"
   viewBox="0 0 1139.8416 585.11163"
   sodipodi:docname="mango-ssd.svg"
   inkscape:version="1.2 (dc2aedaf03, 2022-05-15)"
   xmlns:inkscape="http://www.inkscape.org/namespaces/inkscape"
   xmlns:sodipodi="http://sodipodi.sourceforge.net/DTD/sodipodi-0.dtd"
   xmlns="http://www.w3.org/2000/svg"
   xmlns:svg="http://www.w3.org/2000/svg">
  <defs
     id="defs682">
    <clipPath
       clipPathUnits="userSpaceOnUse"
       id="clipPath700">
      <path
         d="m 58.527,60.898 h 355.09 V 393.539 H 58.527 Z"
         id="path698" />
    </clipPath>
    <clipPath
       clipPathUnits="userSpaceOnUse"
       id="clipPath710">
      <path
         d="M 0,0 H 855 V 439 H 0 Z"
         id="path708" />
    </clipPath>
    <clipPath
       clipPathUnits="userSpaceOnUse"
       id="clipPath726">
      <path
         d="M 0,0 H 855 V 439 H 0 Z"
         id="path724" />
    </clipPath>
    <clipPath
       clipPathUnits="userSpaceOnUse"
       id="clipPath742">
      <path
         d="M 0,0 H 855 V 439 H 0 Z"
         id="path740" />
    </clipPath>
    <clipPath
       clipPathUnits="userSpaceOnUse"
       id="clipPath758">
      <path
         d="M 0,0 H 855 V 439 H 0 Z"
         id="path756" />
    </clipPath>
    <clipPath
       clipPathUnits="userSpaceOnUse"
       id="clipPath774">
      <path
         d="M 0,0 H 855 V 439 H 0 Z"
         id="path772" />
    </clipPath>
    <clipPath
       clipPathUnits="userSpaceOnUse"
       id="clipPath790">
      <path
         d="M 0,0 H 855 V 439 H 0 Z"
         id="path788" />
    </clipPath>
    <clipPath
       clipPathUnits="userSpaceOnUse"
       id="clipPath806">
      <path
         d="M 0,0 H 855 V 439 H 0 Z"
         id="path804" />
    </clipPath>
    <clipPath
       clipPathUnits="userSpaceOnUse"
       id="clipPath938">
      <path
         d="m 58.527,60.898 h 355.09 V 393.539 H 58.527 Z"
         id="path936" />
    </clipPath>
    <clipPath
       clipPathUnits="userSpaceOnUse"
       id="clipPath948">
      <path
         d="M 0,0 H 855 V 439 H 0 Z"
         id="path946" />
    </clipPath>
    <clipPath
       clipPathUnits="userSpaceOnUse"
       id="clipPath988">
      <path
         d="M 0,0 H 855 V 439 H 0 Z"
         id="path986" />
    </clipPath>
    <clipPath
       clipPathUnits="userSpaceOnUse"
       id="clipPath998">
      <path
         d="m 85.656,88.387 h 16 v 10 h -16 z"
         id="path996" />
    </clipPath>
    <clipPath
       clipPathUnits="userSpaceOnUse"
       id="clipPath1008">
      <path
         d="M 0,0 H 855 V 439 H 0 Z"
         id="path1006" />
    </clipPath>
    <clipPath
       clipPathUnits="userSpaceOnUse"
       id="clipPath1022">
      <path
         d="m 133.129,187.293 h 16 v 10 h -16 z"
         id="path1020" />
    </clipPath>
    <clipPath
       clipPathUnits="userSpaceOnUse"
       id="clipPath1032">
      <path
         d="M 0,0 H 855 V 439 H 0 Z"
         id="path1030" />
    </clipPath>
    <clipPath
       clipPathUnits="userSpaceOnUse"
       id="clipPath1046">
      <path
         d="m 180.602,241.785 h 16 v 10 h -16 z"
         id="path1044" />
    </clipPath>
    <clipPath
       clipPathUnits="userSpaceOnUse"
       id="clipPath1056">
      <path
         d="M 0,0 H 855 V 439 H 0 Z"
         id="path1054" />
    </clipPath>
    <clipPath
       clipPathUnits="userSpaceOnUse"
       id="clipPath1070">
      <path
         d="m 228.074,253.59 h 16 v 10 h -16 z"
         id="path1068" />
    </clipPath>
    <clipPath
       clipPathUnits="userSpaceOnUse"
       id="clipPath1080">
      <path
         d="M 0,0 H 855 V 439 H 0 Z"
         id="path1078" />
    </clipPath>
    <clipPath
       clipPathUnits="userSpaceOnUse"
       id="clipPath1094">
      <path
         d="m 275.547,255.805 h 16 v 10 h -16 z"
         id="path1092" />
    </clipPath>
    <clipPath
       clipPathUnits="userSpaceOnUse"
       id="clipPath1104">
      <path
         d="M 0,0 H 855 V 439 H 0 Z"
         id="path1102" />
    </clipPath>
    <clipPath
       clipPathUnits="userSpaceOnUse"
       id="clipPath1118">
      <path
         d="m 323.02,246.789 h 16 v 10 h -16 z"
         id="path1116" />
    </clipPath>
    <clipPath
       clipPathUnits="userSpaceOnUse"
       id="clipPath1128">
      <path
         d="M 0,0 H 855 V 439 H 0 Z"
         id="path1126" />
    </clipPath>
    <clipPath
       clipPathUnits="userSpaceOnUse"
       id="clipPath1142">
      <path
         d="m 370.488,241.25 h 16 v 10 h -16 z"
         id="path1140" />
    </clipPath>
    <clipPath
       clipPathUnits="userSpaceOnUse"
       id="clipPath1152">
      <path
         d="M 0,0 H 855 V 439 H 0 Z"
         id="path1150" />
    </clipPath>
    <clipPath
       clipPathUnits="userSpaceOnUse"
       id="clipPath1168">
      <path
         d="M 0,0 H 855 V 439 H 0 Z"
         id="path1166" />
    </clipPath>
    <clipPath
       clipPathUnits="userSpaceOnUse"
       id="clipPath1178">
      <path
         d="m 85.656,84.621 h 16 v 10 h -16 z"
         id="path1176" />
    </clipPath>
    <clipPath
       clipPathUnits="userSpaceOnUse"
       id="clipPath1188">
      <path
         d="M 0,0 H 855 V 439 H 0 Z"
         id="path1186" />
    </clipPath>
    <clipPath
       clipPathUnits="userSpaceOnUse"
       id="clipPath1202">
      <path
         d="m 133.129,183.449 h 16 v 10 h -16 z"
         id="path1200" />
    </clipPath>
    <clipPath
       clipPathUnits="userSpaceOnUse"
       id="clipPath1212">
      <path
         d="M 0,0 H 855 V 439 H 0 Z"
         id="path1210" />
    </clipPath>
    <clipPath
       clipPathUnits="userSpaceOnUse"
       id="clipPath1226">
      <path
         d="m 180.602,237.312 h 16 v 10 h -16 z"
         id="path1224" />
    </clipPath>
    <clipPath
       clipPathUnits="userSpaceOnUse"
       id="clipPath1236">
      <path
         d="M 0,0 H 855 V 439 H 0 Z"
         id="path1234" />
    </clipPath>
    <clipPath
       clipPathUnits="userSpaceOnUse"
       id="clipPath1250">
      <path
         d="m 228.074,247.93 h 16 v 10 h -16 z"
         id="path1248" />
    </clipPath>
    <clipPath
       clipPathUnits="userSpaceOnUse"
       id="clipPath1260">
      <path
         d="M 0,0 H 855 V 439 H 0 Z"
         id="path1258" />
    </clipPath>
    <clipPath
       clipPathUnits="userSpaceOnUse"
       id="clipPath1274">
      <path
         d="m 275.547,249.426 h 16 v 10 h -16 z"
         id="path1272" />
    </clipPath>
    <clipPath
       clipPathUnits="userSpaceOnUse"
       id="clipPath1284">
      <path
         d="M 0,0 H 855 V 439 H 0 Z"
         id="path1282" />
    </clipPath>
    <clipPath
       clipPathUnits="userSpaceOnUse"
       id="clipPath1298">
      <path
         d="m 323.02,241.258 h 16 v 10 h -16 z"
         id="path1296" />
    </clipPath>
    <clipPath
       clipPathUnits="userSpaceOnUse"
       id="clipPath1308">
      <path
         d="M 0,0 H 855 V 439 H 0 Z"
         id="path1306" />
    </clipPath>
    <clipPath
       clipPathUnits="userSpaceOnUse"
       id="clipPath1322">
      <path
         d="m 370.488,232.641 h 16 v 10 h -16 z"
         id="path1320" />
    </clipPath>
    <clipPath
       clipPathUnits="userSpaceOnUse"
       id="clipPath1332">
      <path
         d="M 0,0 H 855 V 439 H 0 Z"
         id="path1330" />
    </clipPath>
    <clipPath
       clipPathUnits="userSpaceOnUse"
       id="clipPath1384">
      <path
         d="m 484.637,60.898 h 355.09 v 332.641 h -355.09 z"
         id="path1382" />
    </clipPath>
    <clipPath
       clipPathUnits="userSpaceOnUse"
       id="clipPath1394">
      <path
         d="M 0,0 H 855 V 439 H 0 Z"
         id="path1392" />
    </clipPath>
    <clipPath
       clipPathUnits="userSpaceOnUse"
       id="clipPath1410">
      <path
         d="M 0,0 H 855 V 439 H 0 Z"
         id="path1408" />
    </clipPath>
    <clipPath
       clipPathUnits="userSpaceOnUse"
       id="clipPath1426">
      <path
         d="M 0,0 H 855 V 439 H 0 Z"
         id="path1424" />
    </clipPath>
    <clipPath
       clipPathUnits="userSpaceOnUse"
       id="clipPath1442">
      <path
         d="M 0,0 H 855 V 439 H 0 Z"
         id="path1440" />
    </clipPath>
    <clipPath
       clipPathUnits="userSpaceOnUse"
       id="clipPath1458">
      <path
         d="M 0,0 H 855 V 439 H 0 Z"
         id="path1456" />
    </clipPath>
    <clipPath
       clipPathUnits="userSpaceOnUse"
       id="clipPath1474">
      <path
         d="M 0,0 H 855 V 439 H 0 Z"
         id="path1472" />
    </clipPath>
    <clipPath
       clipPathUnits="userSpaceOnUse"
       id="clipPath1490">
      <path
         d="M 0,0 H 855 V 439 H 0 Z"
         id="path1488" />
    </clipPath>
    <clipPath
       clipPathUnits="userSpaceOnUse"
       id="clipPath1618">
      <path
         d="m 484.637,60.898 h 355.09 v 332.641 h -355.09 z"
         id="path1616" />
    </clipPath>
    <clipPath
       clipPathUnits="userSpaceOnUse"
       id="clipPath1628">
      <path
         d="M 0,0 H 855 V 439 H 0 Z"
         id="path1626" />
    </clipPath>
    <clipPath
       clipPathUnits="userSpaceOnUse"
       id="clipPath1668">
      <path
         d="M 0,0 H 855 V 439 H 0 Z"
         id="path1666" />
    </clipPath>
    <clipPath
       clipPathUnits="userSpaceOnUse"
       id="clipPath1678">
      <path
         d="m 511.766,93.105 h 16 v 10 h -16 z"
         id="path1676" />
    </clipPath>
    <clipPath
       clipPathUnits="userSpaceOnUse"
       id="clipPath1688">
      <path
         d="M 0,0 H 855 V 439 H 0 Z"
         id="path1686" />
    </clipPath>
    <clipPath
       clipPathUnits="userSpaceOnUse"
       id="clipPath1702">
      <path
         d="m 559.238,195.715 h 16 v 10 h -16 z"
         id="path1700" />
    </clipPath>
    <clipPath
       clipPathUnits="userSpaceOnUse"
       id="clipPath1712">
      <path
         d="M 0,0 H 855 V 439 H 0 Z"
         id="path1710" />
    </clipPath>
    <clipPath
       clipPathUnits="userSpaceOnUse"
       id="clipPath1726">
      <path
         d="m 606.711,271.602 h 16 v 10 h -16 z"
         id="path1724" />
    </clipPath>
    <clipPath
       clipPathUnits="userSpaceOnUse"
       id="clipPath1736">
      <path
         d="M 0,0 H 855 V 439 H 0 Z"
         id="path1734" />
    </clipPath>
    <clipPath
       clipPathUnits="userSpaceOnUse"
       id="clipPath1750">
      <path
         d="m 654.184,300.605 h 16 v 10 h -16 z"
         id="path1748" />
    </clipPath>
    <clipPath
       clipPathUnits="userSpaceOnUse"
       id="clipPath1760">
      <path
         d="M 0,0 H 855 V 439 H 0 Z"
         id="path1758" />
    </clipPath>
    <clipPath
       clipPathUnits="userSpaceOnUse"
       id="clipPath1774">
      <path
         d="m 701.656,308.25 h 16 v 10 h -16 z"
         id="path1772" />
    </clipPath>
    <clipPath
       clipPathUnits="userSpaceOnUse"
       id="clipPath1784">
      <path
         d="M 0,0 H 855 V 439 H 0 Z"
         id="path1782" />
    </clipPath>
    <clipPath
       clipPathUnits="userSpaceOnUse"
       id="clipPath1798">
      <path
         d="m 749.125,309.012 h 16 v 10 h -16 z"
         id="path1796" />
    </clipPath>
    <clipPath
       clipPathUnits="userSpaceOnUse"
       id="clipPath1808">
      <path
         d="M 0,0 H 855 V 439 H 0 Z"
         id="path1806" />
    </clipPath>
    <clipPath
       clipPathUnits="userSpaceOnUse"
       id="clipPath1822">
      <path
         d="m 796.598,309.148 h 16 v 10 h -16 z"
         id="path1820" />
    </clipPath>
    <clipPath
       clipPathUnits="userSpaceOnUse"
       id="clipPath1832">
      <path
         d="M 0,0 H 855 V 439 H 0 Z"
         id="path1830" />
    </clipPath>
    <clipPath
       clipPathUnits="userSpaceOnUse"
       id="clipPath1848">
      <path
         d="M 0,0 H 855 V 439 H 0 Z"
         id="path1846" />
    </clipPath>
    <clipPath
       clipPathUnits="userSpaceOnUse"
       id="clipPath1858">
      <path
         d="m 511.766,84.621 h 16 v 10 h -16 z"
         id="path1856" />
    </clipPath>
    <clipPath
       clipPathUnits="userSpaceOnUse"
       id="clipPath1868">
      <path
         d="M 0,0 H 855 V 439 H 0 Z"
         id="path1866" />
    </clipPath>
    <clipPath
       clipPathUnits="userSpaceOnUse"
       id="clipPath1882">
      <path
         d="m 559.238,189.703 h 16 v 10 h -16 z"
         id="path1880" />
    </clipPath>
    <clipPath
       clipPathUnits="userSpaceOnUse"
       id="clipPath1892">
      <path
         d="M 0,0 H 855 V 439 H 0 Z"
         id="path1890" />
    </clipPath>
    <clipPath
       clipPathUnits="userSpaceOnUse"
       id="clipPath1906">
      <path
         d="m 606.711,261.719 h 16 v 10 h -16 z"
         id="path1904" />
    </clipPath>
    <clipPath
       clipPathUnits="userSpaceOnUse"
       id="clipPath1916">
      <path
         d="M 0,0 H 855 V 439 H 0 Z"
         id="path1914" />
    </clipPath>
    <clipPath
       clipPathUnits="userSpaceOnUse"
       id="clipPath1930">
      <path
         d="m 654.184,297.418 h 16 v 10 h -16 z"
         id="path1928" />
    </clipPath>
    <clipPath
       clipPathUnits="userSpaceOnUse"
       id="clipPath1940">
      <path
         d="M 0,0 H 855 V 439 H 0 Z"
         id="path1938" />
    </clipPath>
    <clipPath
       clipPathUnits="userSpaceOnUse"
       id="clipPath1954">
      <path
         d="m 701.656,306.477 h 16 v 10 h -16 z"
         id="path1952" />
    </clipPath>
    <clipPath
       clipPathUnits="userSpaceOnUse"
       id="clipPath1964">
      <path
         d="M 0,0 H 855 V 439 H 0 Z"
         id="path1962" />
    </clipPath>
    <clipPath
       clipPathUnits="userSpaceOnUse"
       id="clipPath1978">
      <path
         d="m 749.125,308.16 h 16 v 10 h -16 z"
         id="path1976" />
    </clipPath>
    <clipPath
       clipPathUnits="userSpaceOnUse"
       id="clipPath1988">
      <path
         d="M 0,0 H 855 V 439 H 0 Z"
         id="path1986" />
    </clipPath>
    <clipPath
       clipPathUnits="userSpaceOnUse"
       id="clipPath2002">
      <path
         d="m 796.598,308.254 h 16 v 10 h -16 z"
         id="path2000" />
    </clipPath>
    <clipPath
       clipPathUnits="userSpaceOnUse"
       id="clipPath2012">
      <path
         d="M 0,0 H 855 V 439 H 0 Z"
         id="path2010" />
    </clipPath>
  </defs>
  <sodipodi:namedview
     id="namedview680"
     pagecolor="#ffffff"
     bordercolor="#666666"
     borderopacity="1.0"
     inkscape:showpageshadow="2"
     inkscape:pageopacity="0.0"
     inkscape:pagecheckerboard="0"
     inkscape:deskcolor="#d1d1d1"
     showgrid="false"
     inkscape:zoom="1.3313699"
     inkscape:cx="568.5873"
     inkscape:cy="292.55582"
     inkscape:window-width="1920"
     inkscape:window-height="1002"
     inkscape:window-x="0"
     inkscape:window-y="0"
     inkscape:window-maximized="1"
     inkscape:current-layer="g686">
    <inkscape:page
       x="0"
       y="0"
       id="page684"
       width="1139.8416"
       height="585.11163" />
  </sodipodi:namedview>
  <g
     id="g686"
     inkscape:groupmode="layer"
     inkscape:label="Page 1"
     transform="matrix(1.3333333,0,0,1.3333333,0,1.1294458e-5)">
    <g
       id="g688">
      <path
         d="M 0,0 H 854.883 V 438.832 H 0 Z"
         style="fill:#ffffff;fill-opacity:1;fill-rule:nonzero;stroke:none"
         id="path690" />
      <path
         d="m 58.527,60.898 h 355.09 V 393.539 H 58.527 Z"
         style="fill:#ffffff;fill-opacity:1;fill-rule:nonzero;stroke:none"
         id="path692" />
    </g>
    <g
       id="g694">
      <g
         id="g696"
         clip-path="url(#clipPath700)">
        <g
           id="g702">
          <g
             id="g704">
            <g
               id="g706"
               clip-path="url(#clipPath710)">
              <g
                 id="g712">
                <g
                   id="g714"
                   transform="scale(1,-1)">
                  <path
                     d="m 74.668,-91.504 h 37.977 V -393.539 H 74.668 Z"
                     style="fill:#9467bd;fill-opacity:1;fill-rule:nonzero;stroke:#000000;stroke-width:1;stroke-linecap:butt;stroke-linejoin:miter;stroke-miterlimit:10;stroke-dasharray:none;stroke-opacity:1"
                     id="path716" />
                </g>
              </g>
            </g>
          </g>
        </g>
        <g
           id="g718">
          <g
             id="g720">
            <g
               id="g722"
               clip-path="url(#clipPath726)">
              <g
                 id="g728">
                <g
                   id="g730"
                   transform="scale(1,-1)">
                  <path
                     d="m 122.141,-190.371 h 37.977 v -203.168 h -37.977 z"
                     style="fill:#9467bd;fill-opacity:1;fill-rule:nonzero;stroke:#000000;stroke-width:1;stroke-linecap:butt;stroke-linejoin:miter;stroke-miterlimit:10;stroke-dasharray:none;stroke-opacity:1"
                     id="path732" />
                </g>
              </g>
            </g>
          </g>
        </g>
        <g
           id="g734">
          <g
             id="g736">
            <g
               id="g738"
               clip-path="url(#clipPath742)">
              <g
                 id="g744">
                <g
                   id="g746"
                   transform="scale(1,-1)">
                  <path
                     d="M 169.613,-244.547 H 207.59 V -393.539 H 169.613 Z"
                     style="fill:#9467bd;fill-opacity:1;fill-rule:nonzero;stroke:#000000;stroke-width:1;stroke-linecap:butt;stroke-linejoin:miter;stroke-miterlimit:10;stroke-dasharray:none;stroke-opacity:1"
                     id="path748" />
                </g>
              </g>
            </g>
          </g>
        </g>
        <g
           id="g750">
          <g
             id="g752">
            <g
               id="g754"
               clip-path="url(#clipPath758)">
              <g
                 id="g760">
                <g
                   id="g762"
                   transform="scale(1,-1)">
                  <path
                     d="m 217.086,-255.762 h 37.977 v -137.777 h -37.977 z"
                     style="fill:#9467bd;fill-opacity:1;fill-rule:nonzero;stroke:#000000;stroke-width:1;stroke-linecap:butt;stroke-linejoin:miter;stroke-miterlimit:10;stroke-dasharray:none;stroke-opacity:1"
                     id="path764" />
                </g>
              </g>
            </g>
          </g>
        </g>
        <g
           id="g766">
          <g
             id="g768">
            <g
               id="g770"
               clip-path="url(#clipPath774)">
              <g
                 id="g776">
                <g
                   id="g778"
                   transform="scale(1,-1)">
                  <path
                     d="m 264.559,-257.617 h 37.977 v -135.922 h -37.977 z"
                     style="fill:#9467bd;fill-opacity:1;fill-rule:nonzero;stroke:#000000;stroke-width:1;stroke-linecap:butt;stroke-linejoin:miter;stroke-miterlimit:10;stroke-dasharray:none;stroke-opacity:1"
                     id="path780" />
                </g>
              </g>
            </g>
          </g>
        </g>
        <g
           id="g782">
          <g
             id="g784">
            <g
               id="g786"
               clip-path="url(#clipPath790)">
              <g
                 id="g792">
                <g
                   id="g794"
                   transform="scale(1,-1)">
                  <path
                     d="m 312.027,-249.023 h 37.98 v -144.516 h -37.98 z"
                     style="fill:#9467bd;fill-opacity:1;fill-rule:nonzero;stroke:#000000;stroke-width:1;stroke-linecap:butt;stroke-linejoin:miter;stroke-miterlimit:10;stroke-dasharray:none;stroke-opacity:1"
                     id="path796" />
                </g>
              </g>
            </g>
          </g>
        </g>
        <g
           id="g798">
          <g
             id="g800">
            <g
               id="g802"
               clip-path="url(#clipPath806)">
              <g
                 id="g808">
                <g
                   id="g810"
                   transform="scale(1,-1)">
                  <path
                     d="m 359.5,-241.945 h 37.98 V -393.539 H 359.5 Z"
                     style="fill:#9467bd;fill-opacity:1;fill-rule:nonzero;stroke:#000000;stroke-width:1;stroke-linecap:butt;stroke-linejoin:miter;stroke-miterlimit:10;stroke-dasharray:none;stroke-opacity:1"
                     id="path812" />
                </g>
              </g>
            </g>
          </g>
        </g>
      </g>
    </g>
    <g
       id="g814">
      <g
         id="g816"
         transform="scale(1,-1)">
        <path
           d="m 93.656,-393.539 v -3.5"
           style="fill:none;stroke:#000000;stroke-width:0.8;stroke-linecap:butt;stroke-linejoin:round;stroke-miterlimit:10;stroke-dasharray:none;stroke-opacity:1"
           id="path818" />
      </g>
      <text
         xml:space="preserve"
         transform="translate(87.930875,414.21186)"
         style="font-variant:normal;font-weight:normal;font-size:18px;font-family:'DejaVu Sans';-inkscape-font-specification:DejaVuSans;writing-mode:lr-tb;fill:#000000;fill-opacity:1;fill-rule:nonzero;stroke:none"
         id="text822"><tspan
           x="0"
           y="0"
           id="tspan820">1</tspan></text>
      <g
         id="g824"
         transform="scale(1,-1)">
        <path
           d="m 141.129,-393.539 v -3.5"
           style="fill:none;stroke:#000000;stroke-width:0.8;stroke-linecap:butt;stroke-linejoin:round;stroke-miterlimit:10;stroke-dasharray:none;stroke-opacity:1"
           id="path826" />
      </g>
      <text
         xml:space="preserve"
         transform="translate(135.40292,414.21186)"
         style="font-variant:normal;font-weight:normal;font-size:18px;font-family:'DejaVu Sans';-inkscape-font-specification:DejaVuSans;writing-mode:lr-tb;fill:#000000;fill-opacity:1;fill-rule:nonzero;stroke:none"
         id="text830"><tspan
           x="0"
           y="0"
           id="tspan828">2</tspan></text>
      <g
         id="g832"
         transform="scale(1,-1)">
        <path
           d="m 188.602,-393.539 v -3.5"
           style="fill:none;stroke:#000000;stroke-width:0.8;stroke-linecap:butt;stroke-linejoin:round;stroke-miterlimit:10;stroke-dasharray:none;stroke-opacity:1"
           id="path834" />
      </g>
      <text
         xml:space="preserve"
         transform="translate(182.87496,414.21186)"
         style="font-variant:normal;font-weight:normal;font-size:18px;font-family:'DejaVu Sans';-inkscape-font-specification:DejaVuSans;writing-mode:lr-tb;fill:#000000;fill-opacity:1;fill-rule:nonzero;stroke:none"
         id="text838"><tspan
           x="0"
           y="0"
           id="tspan836">4</tspan></text>
      <g
         id="g840"
         transform="scale(1,-1)">
        <path
           d="m 236.074,-393.539 v -3.5"
           style="fill:none;stroke:#000000;stroke-width:0.8;stroke-linecap:butt;stroke-linejoin:round;stroke-miterlimit:10;stroke-dasharray:none;stroke-opacity:1"
           id="path842" />
      </g>
      <text
         xml:space="preserve"
         transform="translate(230.34701,414.21186)"
         style="font-variant:normal;font-weight:normal;font-size:18px;font-family:'DejaVu Sans';-inkscape-font-specification:DejaVuSans;writing-mode:lr-tb;fill:#000000;fill-opacity:1;fill-rule:nonzero;stroke:none"
         id="text846"><tspan
           x="0"
           y="0"
           id="tspan844">8</tspan></text>
      <g
         id="g848"
         transform="scale(1,-1)">
        <path
           d="m 283.547,-393.539 v -3.5"
           style="fill:none;stroke:#000000;stroke-width:0.8;stroke-linecap:butt;stroke-linejoin:round;stroke-miterlimit:10;stroke-dasharray:none;stroke-opacity:1"
           id="path850" />
      </g>
      <text
         xml:space="preserve"
         transform="translate(272.09249,414.21186)"
         style="font-variant:normal;font-weight:normal;font-size:18px;font-family:'DejaVu Sans';-inkscape-font-specification:DejaVuSans;writing-mode:lr-tb;fill:#000000;fill-opacity:1;fill-rule:nonzero;stroke:none"
         id="text854"><tspan
           x="0 11.448"
           y="0"
           sodipodi:role="line"
           id="tspan852">16</tspan></text>
      <g
         id="g856"
         transform="scale(1,-1)">
        <path
           d="m 331.02,-393.539 v -3.5"
           style="fill:none;stroke:#000000;stroke-width:0.8;stroke-linecap:butt;stroke-linejoin:round;stroke-miterlimit:10;stroke-dasharray:none;stroke-opacity:1"
           id="path858" />
      </g>
      <text
         xml:space="preserve"
         transform="translate(319.56454,414.21186)"
         style="font-variant:normal;font-weight:normal;font-size:18px;font-family:'DejaVu Sans';-inkscape-font-specification:DejaVuSans;writing-mode:lr-tb;fill:#000000;fill-opacity:1;fill-rule:nonzero;stroke:none"
         id="text862"><tspan
           x="0 11.448"
           y="0"
           sodipodi:role="line"
           id="tspan860">32</tspan></text>
      <g
         id="g864"
         transform="scale(1,-1)">
        <path
           d="m 378.488,-393.539 v -3.5"
           style="fill:none;stroke:#000000;stroke-width:0.8;stroke-linecap:butt;stroke-linejoin:round;stroke-miterlimit:10;stroke-dasharray:none;stroke-opacity:1"
           id="path866" />
      </g>
      <text
         xml:space="preserve"
         transform="translate(367.03658,414.21186)"
         style="font-variant:normal;font-weight:normal;font-size:18px;font-family:'DejaVu Sans';-inkscape-font-specification:DejaVuSans;writing-mode:lr-tb;fill:#000000;fill-opacity:1;fill-rule:nonzero;stroke:none"
         id="text870"><tspan
           x="0 11.448"
           y="0"
           sodipodi:role="line"
           id="tspan868">64</tspan></text>
      <g
         id="g872"
         transform="scale(1,-1)">
        <path
           d="m 58.527,-393.539 h -3.5"
           style="fill:none;stroke:#000000;stroke-width:0.8;stroke-linecap:butt;stroke-linejoin:round;stroke-miterlimit:10;stroke-dasharray:none;stroke-opacity:1"
           id="path874" />
      </g>
      <text
         xml:space="preserve"
         transform="translate(40.074999,400.37593)"
         style="font-variant:normal;font-weight:normal;font-size:18px;font-family:'DejaVu Sans';-inkscape-font-specification:DejaVuSans;writing-mode:lr-tb;fill:#000000;fill-opacity:1;fill-rule:nonzero;stroke:none"
         id="text878"><tspan
           x="0"
           y="0"
           id="tspan876">0</tspan></text>
      <g
         id="g880"
         transform="scale(1,-1)">
        <path
           d="m 58.527,-338.625 h -3.5"
           style="fill:none;stroke:#000000;stroke-width:0.8;stroke-linecap:butt;stroke-linejoin:round;stroke-miterlimit:10;stroke-dasharray:none;stroke-opacity:1"
           id="path882" />
      </g>
      <text
         xml:space="preserve"
         transform="translate(28.621874,345.46144)"
         style="font-variant:normal;font-weight:normal;font-size:18px;font-family:'DejaVu Sans';-inkscape-font-specification:DejaVuSans;writing-mode:lr-tb;fill:#000000;fill-opacity:1;fill-rule:nonzero;stroke:none"
         id="text886"><tspan
           x="0 11.448"
           y="0"
           sodipodi:role="line"
           id="tspan884">10</tspan></text>
      <g
         id="g888"
         transform="scale(1,-1)">
        <path
           d="m 58.527,-283.711 h -3.5"
           style="fill:none;stroke:#000000;stroke-width:0.8;stroke-linecap:butt;stroke-linejoin:round;stroke-miterlimit:10;stroke-dasharray:none;stroke-opacity:1"
           id="path890" />
      </g>
      <text
         xml:space="preserve"
         transform="translate(28.621874,290.54695)"
         style="font-variant:normal;font-weight:normal;font-size:18px;font-family:'DejaVu Sans';-inkscape-font-specification:DejaVuSans;writing-mode:lr-tb;fill:#000000;fill-opacity:1;fill-rule:nonzero;stroke:none"
         id="text894"><tspan
           x="0 11.448"
           y="0"
           sodipodi:role="line"
           id="tspan892">20</tspan></text>
      <g
         id="g896"
         transform="scale(1,-1)">
        <path
           d="m 58.527,-228.797 h -3.5"
           style="fill:none;stroke:#000000;stroke-width:0.8;stroke-linecap:butt;stroke-linejoin:round;stroke-miterlimit:10;stroke-dasharray:none;stroke-opacity:1"
           id="path898" />
      </g>
      <text
         xml:space="preserve"
         transform="translate(28.621874,235.63246)"
         style="font-variant:normal;font-weight:normal;font-size:18px;font-family:'DejaVu Sans';-inkscape-font-specification:DejaVuSans;writing-mode:lr-tb;fill:#000000;fill-opacity:1;fill-rule:nonzero;stroke:none"
         id="text902"><tspan
           x="0 11.448"
           y="0"
           sodipodi:role="line"
           id="tspan900">30</tspan></text>
      <g
         id="g904"
         transform="scale(1,-1)">
        <path
           d="m 58.527,-173.883 h -3.5"
           style="fill:none;stroke:#000000;stroke-width:0.8;stroke-linecap:butt;stroke-linejoin:round;stroke-miterlimit:10;stroke-dasharray:none;stroke-opacity:1"
           id="path906" />
      </g>
      <text
         xml:space="preserve"
         transform="translate(28.621874,180.71798)"
         style="font-variant:normal;font-weight:normal;font-size:18px;font-family:'DejaVu Sans';-inkscape-font-specification:DejaVuSans;writing-mode:lr-tb;fill:#000000;fill-opacity:1;fill-rule:nonzero;stroke:none"
         id="text910"><tspan
           x="0 11.448"
           y="0"
           sodipodi:role="line"
           id="tspan908">40</tspan></text>
      <g
         id="g912"
         transform="scale(1,-1)">
        <path
           d="m 58.527,-118.969 h -3.5"
           style="fill:none;stroke:#000000;stroke-width:0.8;stroke-linecap:butt;stroke-linejoin:round;stroke-miterlimit:10;stroke-dasharray:none;stroke-opacity:1"
           id="path914" />
      </g>
      <text
         xml:space="preserve"
         transform="translate(28.621874,125.8035)"
         style="font-variant:normal;font-weight:normal;font-size:18px;font-family:'DejaVu Sans';-inkscape-font-specification:DejaVuSans;writing-mode:lr-tb;fill:#000000;fill-opacity:1;fill-rule:nonzero;stroke:none"
         id="text918"><tspan
           x="0 11.448"
           y="0"
           sodipodi:role="line"
           id="tspan916">50</tspan></text>
      <g
         id="g920"
         transform="scale(1,-1)">
        <path
           d="m 58.527,-64.055 h -3.5"
           style="fill:none;stroke:#000000;stroke-width:0.8;stroke-linecap:butt;stroke-linejoin:round;stroke-miterlimit:10;stroke-dasharray:none;stroke-opacity:1"
           id="path922" />
      </g>
      <text
         xml:space="preserve"
         transform="translate(28.621874,70.889008)"
         style="font-variant:normal;font-weight:normal;font-size:18px;font-family:'DejaVu Sans';-inkscape-font-specification:DejaVuSans;writing-mode:lr-tb;fill:#000000;fill-opacity:1;fill-rule:nonzero;stroke:none"
         id="text926"><tspan
           x="0 11.448"
           y="0"
           sodipodi:role="line"
           id="tspan924">60</tspan></text>
      <text
         xml:space="preserve"
         transform="rotate(-90,141.50296,120.63109)"
         style="font-variant:normal;font-weight:normal;font-size:18px;font-family:'DejaVu Sans';-inkscape-font-specification:DejaVuSans;writing-mode:lr-tb;fill:#000000;fill-opacity:1;fill-rule:nonzero;stroke:none"
         id="text930"><tspan
           x="0 7.0560002 12.042 29.573999 40.644001 46.349998 53.369999 62.73"
           y="0"
           sodipodi:role="line"
           id="tspan928">time (s)</tspan></text>
    </g>
    <g
       id="g932">
      <g
         id="g934"
         clip-path="url(#clipPath938)">
        <g
           id="g940">
          <g
             id="g942">
            <g
               id="g944"
               clip-path="url(#clipPath948)">
              <g
                 id="g950">
                <g
                   id="g952"
                   transform="scale(1,-1)">
                  <path
                     d="m 93.656,-93.387 v 3.766"
                     style="fill:none;stroke:#000000;stroke-width:1.5;stroke-linecap:butt;stroke-linejoin:round;stroke-miterlimit:10;stroke-dasharray:none;stroke-opacity:1"
                     id="path954" />
                </g>
                <g
                   id="g956"
                   transform="scale(1,-1)">
                  <path
                     d="m 141.129,-192.293 v 3.844"
                     style="fill:none;stroke:#000000;stroke-width:1.5;stroke-linecap:butt;stroke-linejoin:round;stroke-miterlimit:10;stroke-dasharray:none;stroke-opacity:1"
                     id="path958" />
                </g>
                <g
                   id="g960"
                   transform="scale(1,-1)">
                  <path
                     d="m 188.602,-246.785 v 4.473"
                     style="fill:none;stroke:#000000;stroke-width:1.5;stroke-linecap:butt;stroke-linejoin:round;stroke-miterlimit:10;stroke-dasharray:none;stroke-opacity:1"
                     id="path962" />
                </g>
                <g
                   id="g964"
                   transform="scale(1,-1)">
                  <path
                     d="m 236.074,-258.59 v 5.66"
                     style="fill:none;stroke:#000000;stroke-width:1.5;stroke-linecap:butt;stroke-linejoin:round;stroke-miterlimit:10;stroke-dasharray:none;stroke-opacity:1"
                     id="path966" />
                </g>
                <g
                   id="g968"
                   transform="scale(1,-1)">
                  <path
                     d="m 283.547,-260.805 v 6.379"
                     style="fill:none;stroke:#000000;stroke-width:1.5;stroke-linecap:butt;stroke-linejoin:round;stroke-miterlimit:10;stroke-dasharray:none;stroke-opacity:1"
                     id="path970" />
                </g>
                <g
                   id="g972"
                   transform="scale(1,-1)">
                  <path
                     d="m 331.02,-251.789 v 5.531"
                     style="fill:none;stroke:#000000;stroke-width:1.5;stroke-linecap:butt;stroke-linejoin:round;stroke-miterlimit:10;stroke-dasharray:none;stroke-opacity:1"
                     id="path974" />
                </g>
                <g
                   id="g976"
                   transform="scale(1,-1)">
                  <path
                     d="m 378.488,-246.25 v 8.609"
                     style="fill:none;stroke:#000000;stroke-width:1.5;stroke-linecap:butt;stroke-linejoin:round;stroke-miterlimit:10;stroke-dasharray:none;stroke-opacity:1"
                     id="path978" />
                </g>
              </g>
            </g>
          </g>
        </g>
        <g
           id="g980">
          <g
             id="g982">
            <g
               id="g984"
               clip-path="url(#clipPath988)">
              <g
                 id="g990" />
              <g
                 id="g992">
                <g
                   id="g994"
                   clip-path="url(#clipPath998)">
                  <g
                     id="g1000">
                    <g
                       id="g1002">
                      <g
                         id="g1004"
                         clip-path="url(#clipPath1008)">
                        <g
                           id="g1010">
                          <g
                             id="g1012"
                             transform="scale(1,-1)">
                            <path
                               d="m 96.656,-93.387 h -6"
                               style="fill:none;stroke:#000000;stroke-width:1;stroke-linecap:butt;stroke-linejoin:round;stroke-miterlimit:10;stroke-dasharray:none;stroke-opacity:1"
                               id="path1014" />
                          </g>
                        </g>
                      </g>
                    </g>
                  </g>
                </g>
              </g>
              <g
                 id="g1016">
                <g
                   id="g1018"
                   clip-path="url(#clipPath1022)">
                  <g
                     id="g1024">
                    <g
                       id="g1026">
                      <g
                         id="g1028"
                         clip-path="url(#clipPath1032)">
                        <g
                           id="g1034">
                          <g
                             id="g1036"
                             transform="scale(1,-1)">
                            <path
                               d="m 144.129,-192.293 h -6"
                               style="fill:none;stroke:#000000;stroke-width:1;stroke-linecap:butt;stroke-linejoin:round;stroke-miterlimit:10;stroke-dasharray:none;stroke-opacity:1"
                               id="path1038" />
                          </g>
                        </g>
                      </g>
                    </g>
                  </g>
                </g>
              </g>
              <g
                 id="g1040">
                <g
                   id="g1042"
                   clip-path="url(#clipPath1046)">
                  <g
                     id="g1048">
                    <g
                       id="g1050">
                      <g
                         id="g1052"
                         clip-path="url(#clipPath1056)">
                        <g
                           id="g1058">
                          <g
                             id="g1060"
                             transform="scale(1,-1)">
                            <path
                               d="m 191.602,-246.785 h -6"
                               style="fill:none;stroke:#000000;stroke-width:1;stroke-linecap:butt;stroke-linejoin:round;stroke-miterlimit:10;stroke-dasharray:none;stroke-opacity:1"
                               id="path1062" />
                          </g>
                        </g>
                      </g>
                    </g>
                  </g>
                </g>
              </g>
              <g
                 id="g1064">
                <g
                   id="g1066"
                   clip-path="url(#clipPath1070)">
                  <g
                     id="g1072">
                    <g
                       id="g1074">
                      <g
                         id="g1076"
                         clip-path="url(#clipPath1080)">
                        <g
                           id="g1082">
                          <g
                             id="g1084"
                             transform="scale(1,-1)">
                            <path
                               d="m 239.074,-258.59 h -6"
                               style="fill:none;stroke:#000000;stroke-width:1;stroke-linecap:butt;stroke-linejoin:round;stroke-miterlimit:10;stroke-dasharray:none;stroke-opacity:1"
                               id="path1086" />
                          </g>
                        </g>
                      </g>
                    </g>
                  </g>
                </g>
              </g>
              <g
                 id="g1088">
                <g
                   id="g1090"
                   clip-path="url(#clipPath1094)">
                  <g
                     id="g1096">
                    <g
                       id="g1098">
                      <g
                         id="g1100"
                         clip-path="url(#clipPath1104)">
                        <g
                           id="g1106">
                          <g
                             id="g1108"
                             transform="scale(1,-1)">
                            <path
                               d="m 286.547,-260.805 h -6"
                               style="fill:none;stroke:#000000;stroke-width:1;stroke-linecap:butt;stroke-linejoin:round;stroke-miterlimit:10;stroke-dasharray:none;stroke-opacity:1"
                               id="path1110" />
                          </g>
                        </g>
                      </g>
                    </g>
                  </g>
                </g>
              </g>
              <g
                 id="g1112">
                <g
                   id="g1114"
                   clip-path="url(#clipPath1118)">
                  <g
                     id="g1120">
                    <g
                       id="g1122">
                      <g
                         id="g1124"
                         clip-path="url(#clipPath1128)">
                        <g
                           id="g1130">
                          <g
                             id="g1132"
                             transform="scale(1,-1)">
                            <path
                               d="m 334.02,-251.789 h -6"
                               style="fill:none;stroke:#000000;stroke-width:1;stroke-linecap:butt;stroke-linejoin:round;stroke-miterlimit:10;stroke-dasharray:none;stroke-opacity:1"
                               id="path1134" />
                          </g>
                        </g>
                      </g>
                    </g>
                  </g>
                </g>
              </g>
              <g
                 id="g1136">
                <g
                   id="g1138"
                   clip-path="url(#clipPath1142)">
                  <g
                     id="g1144">
                    <g
                       id="g1146">
                      <g
                         id="g1148"
                         clip-path="url(#clipPath1152)">
                        <g
                           id="g1154">
                          <g
                             id="g1156"
                             transform="scale(1,-1)">
                            <path
                               d="m 381.488,-246.25 h -6"
                               style="fill:none;stroke:#000000;stroke-width:1;stroke-linecap:butt;stroke-linejoin:round;stroke-miterlimit:10;stroke-dasharray:none;stroke-opacity:1"
                               id="path1158" />
                          </g>
                        </g>
                      </g>
                    </g>
                  </g>
                </g>
              </g>
            </g>
          </g>
        </g>
        <g
           id="g1160">
          <g
             id="g1162">
            <g
               id="g1164"
               clip-path="url(#clipPath1168)">
              <g
                 id="g1170" />
              <g
                 id="g1172">
                <g
                   id="g1174"
                   clip-path="url(#clipPath1178)">
                  <g
                     id="g1180">
                    <g
                       id="g1182">
                      <g
                         id="g1184"
                         clip-path="url(#clipPath1188)">
                        <g
                           id="g1190">
                          <g
                             id="g1192"
                             transform="scale(1,-1)">
                            <path
                               d="m 96.656,-89.621 h -6"
                               style="fill:none;stroke:#000000;stroke-width:1;stroke-linecap:butt;stroke-linejoin:round;stroke-miterlimit:10;stroke-dasharray:none;stroke-opacity:1"
                               id="path1194" />
                          </g>
                        </g>
                      </g>
                    </g>
                  </g>
                </g>
              </g>
              <g
                 id="g1196">
                <g
                   id="g1198"
                   clip-path="url(#clipPath1202)">
                  <g
                     id="g1204">
                    <g
                       id="g1206">
                      <g
                         id="g1208"
                         clip-path="url(#clipPath1212)">
                        <g
                           id="g1214">
                          <g
                             id="g1216"
                             transform="scale(1,-1)">
                            <path
                               d="m 144.129,-188.449 h -6"
                               style="fill:none;stroke:#000000;stroke-width:1;stroke-linecap:butt;stroke-linejoin:round;stroke-miterlimit:10;stroke-dasharray:none;stroke-opacity:1"
                               id="path1218" />
                          </g>
                        </g>
                      </g>
                    </g>
                  </g>
                </g>
              </g>
              <g
                 id="g1220">
                <g
                   id="g1222"
                   clip-path="url(#clipPath1226)">
                  <g
                     id="g1228">
                    <g
                       id="g1230">
                      <g
                         id="g1232"
                         clip-path="url(#clipPath1236)">
                        <g
                           id="g1238">
                          <g
                             id="g1240"
                             transform="scale(1,-1)">
                            <path
                               d="m 191.602,-242.312 h -6"
                               style="fill:none;stroke:#000000;stroke-width:1;stroke-linecap:butt;stroke-linejoin:round;stroke-miterlimit:10;stroke-dasharray:none;stroke-opacity:1"
                               id="path1242" />
                          </g>
                        </g>
                      </g>
                    </g>
                  </g>
                </g>
              </g>
              <g
                 id="g1244">
                <g
                   id="g1246"
                   clip-path="url(#clipPath1250)">
                  <g
                     id="g1252">
                    <g
                       id="g1254">
                      <g
                         id="g1256"
                         clip-path="url(#clipPath1260)">
                        <g
                           id="g1262">
                          <g
                             id="g1264"
                             transform="scale(1,-1)">
                            <path
                               d="m 239.074,-252.93 h -6"
                               style="fill:none;stroke:#000000;stroke-width:1;stroke-linecap:butt;stroke-linejoin:round;stroke-miterlimit:10;stroke-dasharray:none;stroke-opacity:1"
                               id="path1266" />
                          </g>
                        </g>
                      </g>
                    </g>
                  </g>
                </g>
              </g>
              <g
                 id="g1268">
                <g
                   id="g1270"
                   clip-path="url(#clipPath1274)">
                  <g
                     id="g1276">
                    <g
                       id="g1278">
                      <g
                         id="g1280"
                         clip-path="url(#clipPath1284)">
                        <g
                           id="g1286">
                          <g
                             id="g1288"
                             transform="scale(1,-1)">
                            <path
                               d="m 286.547,-254.426 h -6"
                               style="fill:none;stroke:#000000;stroke-width:1;stroke-linecap:butt;stroke-linejoin:round;stroke-miterlimit:10;stroke-dasharray:none;stroke-opacity:1"
                               id="path1290" />
                          </g>
                        </g>
                      </g>
                    </g>
                  </g>
                </g>
              </g>
              <g
                 id="g1292">
                <g
                   id="g1294"
                   clip-path="url(#clipPath1298)">
                  <g
                     id="g1300">
                    <g
                       id="g1302">
                      <g
                         id="g1304"
                         clip-path="url(#clipPath1308)">
                        <g
                           id="g1310">
                          <g
                             id="g1312"
                             transform="scale(1,-1)">
                            <path
                               d="m 334.02,-246.258 h -6"
                               style="fill:none;stroke:#000000;stroke-width:1;stroke-linecap:butt;stroke-linejoin:round;stroke-miterlimit:10;stroke-dasharray:none;stroke-opacity:1"
                               id="path1314" />
                          </g>
                        </g>
                      </g>
                    </g>
                  </g>
                </g>
              </g>
              <g
                 id="g1316">
                <g
                   id="g1318"
                   clip-path="url(#clipPath1322)">
                  <g
                     id="g1324">
                    <g
                       id="g1326">
                      <g
                         id="g1328"
                         clip-path="url(#clipPath1332)">
                        <g
                           id="g1334">
                          <g
                             id="g1336"
                             transform="scale(1,-1)">
                            <path
                               d="m 381.488,-237.641 h -6"
                               style="fill:none;stroke:#000000;stroke-width:1;stroke-linecap:butt;stroke-linejoin:round;stroke-miterlimit:10;stroke-dasharray:none;stroke-opacity:1"
                               id="path1338" />
                          </g>
                        </g>
                      </g>
                    </g>
                  </g>
                </g>
              </g>
            </g>
          </g>
        </g>
      </g>
    </g>
    <g
       id="g1340">
      <g
         id="g1342"
         transform="scale(1,-1)">
        <path
           d="M 58.527,-393.539 V -60.898"
           style="fill:none;stroke:#000000;stroke-width:0.8;stroke-linecap:square;stroke-linejoin:miter;stroke-miterlimit:10;stroke-dasharray:none;stroke-opacity:1"
           id="path1344" />
      </g>
      <g
         id="g1346"
         transform="scale(1,-1)">
        <path
           d="M 413.617,-393.539 V -60.898"
           style="fill:none;stroke:#000000;stroke-width:0.8;stroke-linecap:square;stroke-linejoin:miter;stroke-miterlimit:10;stroke-dasharray:none;stroke-opacity:1"
           id="path1348" />
      </g>
      <g
         id="g1350"
         transform="scale(1,-1)">
        <path
           d="m 58.527,-393.539 h 355.09"
           style="fill:none;stroke:#000000;stroke-width:0.8;stroke-linecap:square;stroke-linejoin:miter;stroke-miterlimit:10;stroke-dasharray:none;stroke-opacity:1"
           id="path1352" />
      </g>
      <g
         id="g1354"
         transform="scale(1,-1)">
        <path
           d="m 58.527,-60.898 h 355.09"
           style="fill:none;stroke:#000000;stroke-width:0.8;stroke-linecap:square;stroke-linejoin:miter;stroke-miterlimit:10;stroke-dasharray:none;stroke-opacity:1"
           id="path1356" />
      </g>
      <text
         xml:space="preserve"
         transform="translate(73.618375,82.679248)"
         style="font-variant:normal;font-weight:normal;font-size:18px;font-family:'DejaVu Sans';-inkscape-font-specification:DejaVuSans;writing-mode:lr-tb;fill:#000000;fill-opacity:1;fill-rule:nonzero;stroke:none"
         id="text1374"><tspan
           x="0 11.448 22.896 28.601999"
           y="0"
           sodipodi:role="line"
           id="tspan1358">55.0</tspan><tspan
           x="47.47205 58.920048 70.36805 76.074051"
           y="98.827431"
           sodipodi:role="line"
           id="tspan1360">37.0</tspan><tspan
           x="94.944099 106.3921 117.8401 123.5461"
           y="152.69031"
           sodipodi:role="line"
           id="tspan1362">27.1</tspan><tspan
           x="142.41614 153.86415 165.31215 171.01814"
           y="163.30988"
           sodipodi:role="line"
           id="tspan1364">25.1</tspan><tspan
           x="189.8882 201.3362 212.78419 218.49019"
           y="164.80693"
           sodipodi:role="line"
           id="tspan1366">24.8</tspan><tspan
           x="237.36024 248.80824 260.25623 265.96225"
           y="156.63631"
           sodipodi:role="line"
           id="tspan1368">26.3</tspan><tspan
           x="284.83228 296.28027 307.7283 313.4343"
           y="148.02148"
           sodipodi:role="line"
           id="tspan1370">27.6</tspan><tspan
           x="93.931778 103.99377 115.00977 124.89178 134.66577 145.73578 157.14778 162.85378 177.01978 188.43178 193.41777 204.48778 214.36978 221.42578"
           y="-27.77923"
           sodipodi:role="line"
           id="tspan1372">Packed Objects</tspan></text>
      <path
         d="m 484.637,60.898 h 355.09 v 332.641 h -355.09 z"
         style="fill:#ffffff;fill-opacity:1;fill-rule:nonzero;stroke:none"
         id="path1376" />
    </g>
    <g
       id="g1378">
      <g
         id="g1380"
         clip-path="url(#clipPath1384)">
        <g
           id="g1386">
          <g
             id="g1388">
            <g
               id="g1390"
               clip-path="url(#clipPath1394)">
              <g
                 id="g1396">
                <g
                   id="g1398"
                   transform="scale(1,-1)">
                  <path
                     d="m 500.777,-93.863 h 37.977 v -299.676 h -37.977 z"
                     style="fill:#8c564b;fill-opacity:1;fill-rule:nonzero;stroke:#000000;stroke-width:1;stroke-linecap:butt;stroke-linejoin:miter;stroke-miterlimit:10;stroke-dasharray:none;stroke-opacity:1"
                     id="path1400" />
                </g>
              </g>
            </g>
          </g>
        </g>
        <g
           id="g1402">
          <g
             id="g1404">
            <g
               id="g1406"
               clip-path="url(#clipPath1410)">
              <g
                 id="g1412">
                <g
                   id="g1414"
                   transform="scale(1,-1)">
                  <path
                     d="m 548.25,-197.711 h 37.977 V -393.539 H 548.25 Z"
                     style="fill:#8c564b;fill-opacity:1;fill-rule:nonzero;stroke:#000000;stroke-width:1;stroke-linecap:butt;stroke-linejoin:miter;stroke-miterlimit:10;stroke-dasharray:none;stroke-opacity:1"
                     id="path1416" />
                </g>
              </g>
            </g>
          </g>
        </g>
        <g
           id="g1418">
          <g
             id="g1420">
            <g
               id="g1422"
               clip-path="url(#clipPath1426)">
              <g
                 id="g1428">
                <g
                   id="g1430"
                   transform="scale(1,-1)">
                  <path
                     d="M 595.723,-271.66 H 633.7 v -121.879 h -37.977 z"
                     style="fill:#8c564b;fill-opacity:1;fill-rule:nonzero;stroke:#000000;stroke-width:1;stroke-linecap:butt;stroke-linejoin:miter;stroke-miterlimit:10;stroke-dasharray:none;stroke-opacity:1"
                     id="path1432" />
                </g>
              </g>
            </g>
          </g>
        </g>
        <g
           id="g1434">
          <g
             id="g1436">
            <g
               id="g1438"
               clip-path="url(#clipPath1442)">
              <g
                 id="g1444">
                <g
                   id="g1446"
                   transform="scale(1,-1)">
                  <path
                     d="m 643.195,-304.012 h 37.977 v -89.527 h -37.977 z"
                     style="fill:#8c564b;fill-opacity:1;fill-rule:nonzero;stroke:#000000;stroke-width:1;stroke-linecap:butt;stroke-linejoin:miter;stroke-miterlimit:10;stroke-dasharray:none;stroke-opacity:1"
                     id="path1448" />
                </g>
              </g>
            </g>
          </g>
        </g>
        <g
           id="g1450">
          <g
             id="g1452">
            <g
               id="g1454"
               clip-path="url(#clipPath1458)">
              <g
                 id="g1460">
                <g
                   id="g1462"
                   transform="scale(1,-1)">
                  <path
                     d="m 690.664,-312.363 h 37.98 v -81.176 h -37.98 z"
                     style="fill:#8c564b;fill-opacity:1;fill-rule:nonzero;stroke:#000000;stroke-width:1;stroke-linecap:butt;stroke-linejoin:miter;stroke-miterlimit:10;stroke-dasharray:none;stroke-opacity:1"
                     id="path1464" />
                </g>
              </g>
            </g>
          </g>
        </g>
        <g
           id="g1466">
          <g
             id="g1468">
            <g
               id="g1470"
               clip-path="url(#clipPath1474)">
              <g
                 id="g1476">
                <g
                   id="g1478"
                   transform="scale(1,-1)">
                  <path
                     d="m 738.137,-313.586 h 37.98 v -79.953 h -37.98 z"
                     style="fill:#8c564b;fill-opacity:1;fill-rule:nonzero;stroke:#000000;stroke-width:1;stroke-linecap:butt;stroke-linejoin:miter;stroke-miterlimit:10;stroke-dasharray:none;stroke-opacity:1"
                     id="path1480" />
                </g>
              </g>
            </g>
          </g>
        </g>
        <g
           id="g1482">
          <g
             id="g1484">
            <g
               id="g1486"
               clip-path="url(#clipPath1490)">
              <g
                 id="g1492">
                <g
                   id="g1494"
                   transform="scale(1,-1)">
                  <path
                     d="m 785.609,-313.699 h 37.977 v -79.84 h -37.977 z"
                     style="fill:#8c564b;fill-opacity:1;fill-rule:nonzero;stroke:#000000;stroke-width:1;stroke-linecap:butt;stroke-linejoin:miter;stroke-miterlimit:10;stroke-dasharray:none;stroke-opacity:1"
                     id="path1496" />
                </g>
              </g>
            </g>
          </g>
        </g>
      </g>
    </g>
    <g
       id="g1498">
      <g
         id="g1500"
         transform="scale(1,-1)">
        <path
           d="m 519.766,-393.539 v -3.5"
           style="fill:none;stroke:#000000;stroke-width:0.8;stroke-linecap:butt;stroke-linejoin:round;stroke-miterlimit:10;stroke-dasharray:none;stroke-opacity:1"
           id="path1502" />
      </g>
      <text
         xml:space="preserve"
         transform="translate(514.03996,414.21186)"
         style="font-variant:normal;font-weight:normal;font-size:18px;font-family:'DejaVu Sans';-inkscape-font-specification:DejaVuSans;writing-mode:lr-tb;fill:#000000;fill-opacity:1;fill-rule:nonzero;stroke:none"
         id="text1506"><tspan
           x="0"
           y="0"
           id="tspan1504">1</tspan></text>
      <g
         id="g1508"
         transform="scale(1,-1)">
        <path
           d="m 567.238,-393.539 v -3.5"
           style="fill:none;stroke:#000000;stroke-width:0.8;stroke-linecap:butt;stroke-linejoin:round;stroke-miterlimit:10;stroke-dasharray:none;stroke-opacity:1"
           id="path1510" />
      </g>
      <text
         xml:space="preserve"
         transform="translate(561.512,414.21186)"
         style="font-variant:normal;font-weight:normal;font-size:18px;font-family:'DejaVu Sans';-inkscape-font-specification:DejaVuSans;writing-mode:lr-tb;fill:#000000;fill-opacity:1;fill-rule:nonzero;stroke:none"
         id="text1514"><tspan
           x="0"
           y="0"
           id="tspan1512">2</tspan></text>
      <g
         id="g1516"
         transform="scale(1,-1)">
        <path
           d="m 614.711,-393.539 v -3.5"
           style="fill:none;stroke:#000000;stroke-width:0.8;stroke-linecap:butt;stroke-linejoin:round;stroke-miterlimit:10;stroke-dasharray:none;stroke-opacity:1"
           id="path1518" />
      </g>
      <text
         xml:space="preserve"
         transform="translate(608.98405,414.21186)"
         style="font-variant:normal;font-weight:normal;font-size:18px;font-family:'DejaVu Sans';-inkscape-font-specification:DejaVuSans;writing-mode:lr-tb;fill:#000000;fill-opacity:1;fill-rule:nonzero;stroke:none"
         id="text1522"><tspan
           x="0"
           y="0"
           id="tspan1520">4</tspan></text>
      <g
         id="g1524"
         transform="scale(1,-1)">
        <path
           d="m 662.184,-393.539 v -3.5"
           style="fill:none;stroke:#000000;stroke-width:0.8;stroke-linecap:butt;stroke-linejoin:round;stroke-miterlimit:10;stroke-dasharray:none;stroke-opacity:1"
           id="path1526" />
      </g>
      <text
         xml:space="preserve"
         transform="translate(656.45609,414.21186)"
         style="font-variant:normal;font-weight:normal;font-size:18px;font-family:'DejaVu Sans';-inkscape-font-specification:DejaVuSans;writing-mode:lr-tb;fill:#000000;fill-opacity:1;fill-rule:nonzero;stroke:none"
         id="text1530"><tspan
           x="0"
           y="0"
           id="tspan1528">8</tspan></text>
      <g
         id="g1532"
         transform="scale(1,-1)">
        <path
           d="m 709.656,-393.539 v -3.5"
           style="fill:none;stroke:#000000;stroke-width:0.8;stroke-linecap:butt;stroke-linejoin:round;stroke-miterlimit:10;stroke-dasharray:none;stroke-opacity:1"
           id="path1534" />
      </g>
      <text
         xml:space="preserve"
         transform="translate(698.20157,414.21186)"
         style="font-variant:normal;font-weight:normal;font-size:18px;font-family:'DejaVu Sans';-inkscape-font-specification:DejaVuSans;writing-mode:lr-tb;fill:#000000;fill-opacity:1;fill-rule:nonzero;stroke:none"
         id="text1538"><tspan
           x="0 11.448"
           y="0"
           sodipodi:role="line"
           id="tspan1536">16</tspan></text>
      <g
         id="g1540"
         transform="scale(1,-1)">
        <path
           d="m 757.125,-393.539 v -3.5"
           style="fill:none;stroke:#000000;stroke-width:0.8;stroke-linecap:butt;stroke-linejoin:round;stroke-miterlimit:10;stroke-dasharray:none;stroke-opacity:1"
           id="path1542" />
      </g>
      <text
         xml:space="preserve"
         transform="translate(745.67362,414.21186)"
         style="font-variant:normal;font-weight:normal;font-size:18px;font-family:'DejaVu Sans';-inkscape-font-specification:DejaVuSans;writing-mode:lr-tb;fill:#000000;fill-opacity:1;fill-rule:nonzero;stroke:none"
         id="text1546"><tspan
           x="0 11.448"
           y="0"
           sodipodi:role="line"
           id="tspan1544">32</tspan></text>
      <g
         id="g1548"
         transform="scale(1,-1)">
        <path
           d="m 804.598,-393.539 v -3.5"
           style="fill:none;stroke:#000000;stroke-width:0.8;stroke-linecap:butt;stroke-linejoin:round;stroke-miterlimit:10;stroke-dasharray:none;stroke-opacity:1"
           id="path1550" />
      </g>
      <text
         xml:space="preserve"
         transform="translate(793.14567,414.21186)"
         style="font-variant:normal;font-weight:normal;font-size:18px;font-family:'DejaVu Sans';-inkscape-font-specification:DejaVuSans;writing-mode:lr-tb;fill:#000000;fill-opacity:1;fill-rule:nonzero;stroke:none"
         id="text1554"><tspan
           x="0 11.448"
           y="0"
           sodipodi:role="line"
           id="tspan1552">64</tspan></text>
      <g
         id="g1556"
         transform="scale(1,-1)">
        <path
           d="m 484.637,-393.539 h -3.5"
           style="fill:none;stroke:#000000;stroke-width:0.8;stroke-linecap:butt;stroke-linejoin:round;stroke-miterlimit:10;stroke-dasharray:none;stroke-opacity:1"
           id="path1558" />
      </g>
      <text
         xml:space="preserve"
         transform="translate(466.18408,400.37593)"
         style="font-variant:normal;font-weight:normal;font-size:18px;font-family:'DejaVu Sans';-inkscape-font-specification:DejaVuSans;writing-mode:lr-tb;fill:#000000;fill-opacity:1;fill-rule:nonzero;stroke:none"
         id="text1562"><tspan
           x="0"
           y="0"
           id="tspan1560">0</tspan></text>
      <g
         id="g1564"
         transform="scale(1,-1)">
        <path
           d="m 484.637,-345.719 h -3.5"
           style="fill:none;stroke:#000000;stroke-width:0.8;stroke-linecap:butt;stroke-linejoin:round;stroke-miterlimit:10;stroke-dasharray:none;stroke-opacity:1"
           id="path1566" />
      </g>
      <text
         xml:space="preserve"
         transform="translate(454.73096,352.55444)"
         style="font-variant:normal;font-weight:normal;font-size:18px;font-family:'DejaVu Sans';-inkscape-font-specification:DejaVuSans;writing-mode:lr-tb;fill:#000000;fill-opacity:1;fill-rule:nonzero;stroke:none"
         id="text1570"><tspan
           x="0 11.448"
           y="0"
           sodipodi:role="line"
           id="tspan1568">50</tspan></text>
      <g
         id="g1572"
         transform="scale(1,-1)">
        <path
           d="m 484.637,-297.898 h -3.5"
           style="fill:none;stroke:#000000;stroke-width:0.8;stroke-linecap:butt;stroke-linejoin:round;stroke-miterlimit:10;stroke-dasharray:none;stroke-opacity:1"
           id="path1574" />
      </g>
      <text
         xml:space="preserve"
         transform="translate(443.27783,304.73294)"
         style="font-variant:normal;font-weight:normal;font-size:18px;font-family:'DejaVu Sans';-inkscape-font-specification:DejaVuSans;writing-mode:lr-tb;fill:#000000;fill-opacity:1;fill-rule:nonzero;stroke:none"
         id="text1578"><tspan
           x="0 11.448 22.896"
           y="0"
           sodipodi:role="line"
           id="tspan1576">100</tspan></text>
      <g
         id="g1580"
         transform="scale(1,-1)">
        <path
           d="m 484.637,-250.074 h -3.5"
           style="fill:none;stroke:#000000;stroke-width:0.8;stroke-linecap:butt;stroke-linejoin:round;stroke-miterlimit:10;stroke-dasharray:none;stroke-opacity:1"
           id="path1582" />
      </g>
      <text
         xml:space="preserve"
         transform="translate(443.27783,256.91145)"
         style="font-variant:normal;font-weight:normal;font-size:18px;font-family:'DejaVu Sans';-inkscape-font-specification:DejaVuSans;writing-mode:lr-tb;fill:#000000;fill-opacity:1;fill-rule:nonzero;stroke:none"
         id="text1586"><tspan
           x="0 11.448 22.896"
           y="0"
           sodipodi:role="line"
           id="tspan1584">150</tspan></text>
      <g
         id="g1588"
         transform="scale(1,-1)">
        <path
           d="m 484.637,-202.254 h -3.5"
           style="fill:none;stroke:#000000;stroke-width:0.8;stroke-linecap:butt;stroke-linejoin:round;stroke-miterlimit:10;stroke-dasharray:none;stroke-opacity:1"
           id="path1590" />
      </g>
      <text
         xml:space="preserve"
         transform="translate(443.27783,209.08996)"
         style="font-variant:normal;font-weight:normal;font-size:18px;font-family:'DejaVu Sans';-inkscape-font-specification:DejaVuSans;writing-mode:lr-tb;fill:#000000;fill-opacity:1;fill-rule:nonzero;stroke:none"
         id="text1594"><tspan
           x="0 11.448 22.896"
           y="0"
           sodipodi:role="line"
           id="tspan1592">200</tspan></text>
      <g
         id="g1596"
         transform="scale(1,-1)">
        <path
           d="m 484.637,-154.434 h -3.5"
           style="fill:none;stroke:#000000;stroke-width:0.8;stroke-linecap:butt;stroke-linejoin:round;stroke-miterlimit:10;stroke-dasharray:none;stroke-opacity:1"
           id="path1598" />
      </g>
      <text
         xml:space="preserve"
         transform="translate(443.27783,161.26848)"
         style="font-variant:normal;font-weight:normal;font-size:18px;font-family:'DejaVu Sans';-inkscape-font-specification:DejaVuSans;writing-mode:lr-tb;fill:#000000;fill-opacity:1;fill-rule:nonzero;stroke:none"
         id="text1602"><tspan
           x="0 11.448 22.896"
           y="0"
           sodipodi:role="line"
           id="tspan1600">250</tspan></text>
      <g
         id="g1604"
         transform="scale(1,-1)">
        <path
           d="m 484.637,-106.609 h -3.5"
           style="fill:none;stroke:#000000;stroke-width:0.8;stroke-linecap:butt;stroke-linejoin:round;stroke-miterlimit:10;stroke-dasharray:none;stroke-opacity:1"
           id="path1606" />
      </g>
      <text
         xml:space="preserve"
         transform="translate(443.27783,113.44699)"
         style="font-variant:normal;font-weight:normal;font-size:18px;font-family:'DejaVu Sans';-inkscape-font-specification:DejaVuSans;writing-mode:lr-tb;fill:#000000;fill-opacity:1;fill-rule:nonzero;stroke:none"
         id="text1610"><tspan
           x="0 11.448 22.896"
           y="0"
           sodipodi:role="line"
           id="tspan1608">300</tspan></text>
    </g>
    <g
       id="g1612">
      <g
         id="g1614"
         clip-path="url(#clipPath1618)">
        <g
           id="g1620">
          <g
             id="g1622">
            <g
               id="g1624"
               clip-path="url(#clipPath1628)">
              <g
                 id="g1630">
                <g
                   id="g1632"
                   transform="scale(1,-1)">
                  <path
                     d="m 519.766,-98.105 v 8.484"
                     style="fill:none;stroke:#000000;stroke-width:1.5;stroke-linecap:butt;stroke-linejoin:round;stroke-miterlimit:10;stroke-dasharray:none;stroke-opacity:1"
                     id="path1634" />
                </g>
                <g
                   id="g1636"
                   transform="scale(1,-1)">
                  <path
                     d="m 567.238,-200.715 v 6.012"
                     style="fill:none;stroke:#000000;stroke-width:1.5;stroke-linecap:butt;stroke-linejoin:round;stroke-miterlimit:10;stroke-dasharray:none;stroke-opacity:1"
                     id="path1638" />
                </g>
                <g
                   id="g1640"
                   transform="scale(1,-1)">
                  <path
                     d="m 614.711,-276.602 v 9.883"
                     style="fill:none;stroke:#000000;stroke-width:1.5;stroke-linecap:butt;stroke-linejoin:round;stroke-miterlimit:10;stroke-dasharray:none;stroke-opacity:1"
                     id="path1642" />
                </g>
                <g
                   id="g1644"
                   transform="scale(1,-1)">
                  <path
                     d="m 662.184,-305.605 v 3.187"
                     style="fill:none;stroke:#000000;stroke-width:1.5;stroke-linecap:butt;stroke-linejoin:round;stroke-miterlimit:10;stroke-dasharray:none;stroke-opacity:1"
                     id="path1646" />
                </g>
                <g
                   id="g1648"
                   transform="scale(1,-1)">
                  <path
                     d="m 709.656,-313.25 v 1.773"
                     style="fill:none;stroke:#000000;stroke-width:1.5;stroke-linecap:butt;stroke-linejoin:round;stroke-miterlimit:10;stroke-dasharray:none;stroke-opacity:1"
                     id="path1650" />
                </g>
                <g
                   id="g1652"
                   transform="scale(1,-1)">
                  <path
                     d="m 757.125,-314.012 v 0.852"
                     style="fill:none;stroke:#000000;stroke-width:1.5;stroke-linecap:butt;stroke-linejoin:round;stroke-miterlimit:10;stroke-dasharray:none;stroke-opacity:1"
                     id="path1654" />
                </g>
                <g
                   id="g1656"
                   transform="scale(1,-1)">
                  <path
                     d="m 804.598,-314.148 v 0.894"
                     style="fill:none;stroke:#000000;stroke-width:1.5;stroke-linecap:butt;stroke-linejoin:round;stroke-miterlimit:10;stroke-dasharray:none;stroke-opacity:1"
                     id="path1658" />
                </g>
              </g>
            </g>
          </g>
        </g>
        <g
           id="g1660">
          <g
             id="g1662">
            <g
               id="g1664"
               clip-path="url(#clipPath1668)">
              <g
                 id="g1670" />
              <g
                 id="g1672">
                <g
                   id="g1674"
                   clip-path="url(#clipPath1678)">
                  <g
                     id="g1680">
                    <g
                       id="g1682">
                      <g
                         id="g1684"
                         clip-path="url(#clipPath1688)">
                        <g
                           id="g1690">
                          <g
                             id="g1692"
                             transform="scale(1,-1)">
                            <path
                               d="m 522.766,-98.105 h -6"
                               style="fill:none;stroke:#000000;stroke-width:1;stroke-linecap:butt;stroke-linejoin:round;stroke-miterlimit:10;stroke-dasharray:none;stroke-opacity:1"
                               id="path1694" />
                          </g>
                        </g>
                      </g>
                    </g>
                  </g>
                </g>
              </g>
              <g
                 id="g1696">
                <g
                   id="g1698"
                   clip-path="url(#clipPath1702)">
                  <g
                     id="g1704">
                    <g
                       id="g1706">
                      <g
                         id="g1708"
                         clip-path="url(#clipPath1712)">
                        <g
                           id="g1714">
                          <g
                             id="g1716"
                             transform="scale(1,-1)">
                            <path
                               d="m 570.238,-200.715 h -6"
                               style="fill:none;stroke:#000000;stroke-width:1;stroke-linecap:butt;stroke-linejoin:round;stroke-miterlimit:10;stroke-dasharray:none;stroke-opacity:1"
                               id="path1718" />
                          </g>
                        </g>
                      </g>
                    </g>
                  </g>
                </g>
              </g>
              <g
                 id="g1720">
                <g
                   id="g1722"
                   clip-path="url(#clipPath1726)">
                  <g
                     id="g1728">
                    <g
                       id="g1730">
                      <g
                         id="g1732"
                         clip-path="url(#clipPath1736)">
                        <g
                           id="g1738">
                          <g
                             id="g1740"
                             transform="scale(1,-1)">
                            <path
                               d="m 617.711,-276.602 h -6"
                               style="fill:none;stroke:#000000;stroke-width:1;stroke-linecap:butt;stroke-linejoin:round;stroke-miterlimit:10;stroke-dasharray:none;stroke-opacity:1"
                               id="path1742" />
                          </g>
                        </g>
                      </g>
                    </g>
                  </g>
                </g>
              </g>
              <g
                 id="g1744">
                <g
                   id="g1746"
                   clip-path="url(#clipPath1750)">
                  <g
                     id="g1752">
                    <g
                       id="g1754">
                      <g
                         id="g1756"
                         clip-path="url(#clipPath1760)">
                        <g
                           id="g1762">
                          <g
                             id="g1764"
                             transform="scale(1,-1)">
                            <path
                               d="m 665.184,-305.605 h -6"
                               style="fill:none;stroke:#000000;stroke-width:1;stroke-linecap:butt;stroke-linejoin:round;stroke-miterlimit:10;stroke-dasharray:none;stroke-opacity:1"
                               id="path1766" />
                          </g>
                        </g>
                      </g>
                    </g>
                  </g>
                </g>
              </g>
              <g
                 id="g1768">
                <g
                   id="g1770"
                   clip-path="url(#clipPath1774)">
                  <g
                     id="g1776">
                    <g
                       id="g1778">
                      <g
                         id="g1780"
                         clip-path="url(#clipPath1784)">
                        <g
                           id="g1786">
                          <g
                             id="g1788"
                             transform="scale(1,-1)">
                            <path
                               d="m 712.656,-313.25 h -6"
                               style="fill:none;stroke:#000000;stroke-width:1;stroke-linecap:butt;stroke-linejoin:round;stroke-miterlimit:10;stroke-dasharray:none;stroke-opacity:1"
                               id="path1790" />
                          </g>
                        </g>
                      </g>
                    </g>
                  </g>
                </g>
              </g>
              <g
                 id="g1792">
                <g
                   id="g1794"
                   clip-path="url(#clipPath1798)">
                  <g
                     id="g1800">
                    <g
                       id="g1802">
                      <g
                         id="g1804"
                         clip-path="url(#clipPath1808)">
                        <g
                           id="g1810">
                          <g
                             id="g1812"
                             transform="scale(1,-1)">
                            <path
                               d="m 760.125,-314.012 h -6"
                               style="fill:none;stroke:#000000;stroke-width:1;stroke-linecap:butt;stroke-linejoin:round;stroke-miterlimit:10;stroke-dasharray:none;stroke-opacity:1"
                               id="path1814" />
                          </g>
                        </g>
                      </g>
                    </g>
                  </g>
                </g>
              </g>
              <g
                 id="g1816">
                <g
                   id="g1818"
                   clip-path="url(#clipPath1822)">
                  <g
                     id="g1824">
                    <g
                       id="g1826">
                      <g
                         id="g1828"
                         clip-path="url(#clipPath1832)">
                        <g
                           id="g1834">
                          <g
                             id="g1836"
                             transform="scale(1,-1)">
                            <path
                               d="m 807.598,-314.148 h -6"
                               style="fill:none;stroke:#000000;stroke-width:1;stroke-linecap:butt;stroke-linejoin:round;stroke-miterlimit:10;stroke-dasharray:none;stroke-opacity:1"
                               id="path1838" />
                          </g>
                        </g>
                      </g>
                    </g>
                  </g>
                </g>
              </g>
            </g>
          </g>
        </g>
        <g
           id="g1840">
          <g
             id="g1842">
            <g
               id="g1844"
               clip-path="url(#clipPath1848)">
              <g
                 id="g1850" />
              <g
                 id="g1852">
                <g
                   id="g1854"
                   clip-path="url(#clipPath1858)">
                  <g
                     id="g1860">
                    <g
                       id="g1862">
                      <g
                         id="g1864"
                         clip-path="url(#clipPath1868)">
                        <g
                           id="g1870">
                          <g
                             id="g1872"
                             transform="scale(1,-1)">
                            <path
                               d="m 522.766,-89.621 h -6"
                               style="fill:none;stroke:#000000;stroke-width:1;stroke-linecap:butt;stroke-linejoin:round;stroke-miterlimit:10;stroke-dasharray:none;stroke-opacity:1"
                               id="path1874" />
                          </g>
                        </g>
                      </g>
                    </g>
                  </g>
                </g>
              </g>
              <g
                 id="g1876">
                <g
                   id="g1878"
                   clip-path="url(#clipPath1882)">
                  <g
                     id="g1884">
                    <g
                       id="g1886">
                      <g
                         id="g1888"
                         clip-path="url(#clipPath1892)">
                        <g
                           id="g1894">
                          <g
                             id="g1896"
                             transform="scale(1,-1)">
                            <path
                               d="m 570.238,-194.703 h -6"
                               style="fill:none;stroke:#000000;stroke-width:1;stroke-linecap:butt;stroke-linejoin:round;stroke-miterlimit:10;stroke-dasharray:none;stroke-opacity:1"
                               id="path1898" />
                          </g>
                        </g>
                      </g>
                    </g>
                  </g>
                </g>
              </g>
              <g
                 id="g1900">
                <g
                   id="g1902"
                   clip-path="url(#clipPath1906)">
                  <g
                     id="g1908">
                    <g
                       id="g1910">
                      <g
                         id="g1912"
                         clip-path="url(#clipPath1916)">
                        <g
                           id="g1918">
                          <g
                             id="g1920"
                             transform="scale(1,-1)">
                            <path
                               d="m 617.711,-266.719 h -6"
                               style="fill:none;stroke:#000000;stroke-width:1;stroke-linecap:butt;stroke-linejoin:round;stroke-miterlimit:10;stroke-dasharray:none;stroke-opacity:1"
                               id="path1922" />
                          </g>
                        </g>
                      </g>
                    </g>
                  </g>
                </g>
              </g>
              <g
                 id="g1924">
                <g
                   id="g1926"
                   clip-path="url(#clipPath1930)">
                  <g
                     id="g1932">
                    <g
                       id="g1934">
                      <g
                         id="g1936"
                         clip-path="url(#clipPath1940)">
                        <g
                           id="g1942">
                          <g
                             id="g1944"
                             transform="scale(1,-1)">
                            <path
                               d="m 665.184,-302.418 h -6"
                               style="fill:none;stroke:#000000;stroke-width:1;stroke-linecap:butt;stroke-linejoin:round;stroke-miterlimit:10;stroke-dasharray:none;stroke-opacity:1"
                               id="path1946" />
                          </g>
                        </g>
                      </g>
                    </g>
                  </g>
                </g>
              </g>
              <g
                 id="g1948">
                <g
                   id="g1950"
                   clip-path="url(#clipPath1954)">
                  <g
                     id="g1956">
                    <g
                       id="g1958">
                      <g
                         id="g1960"
                         clip-path="url(#clipPath1964)">
                        <g
                           id="g1966">
                          <g
                             id="g1968"
                             transform="scale(1,-1)">
                            <path
                               d="m 712.656,-311.477 h -6"
                               style="fill:none;stroke:#000000;stroke-width:1;stroke-linecap:butt;stroke-linejoin:round;stroke-miterlimit:10;stroke-dasharray:none;stroke-opacity:1"
                               id="path1970" />
                          </g>
                        </g>
                      </g>
                    </g>
                  </g>
                </g>
              </g>
              <g
                 id="g1972">
                <g
                   id="g1974"
                   clip-path="url(#clipPath1978)">
                  <g
                     id="g1980">
                    <g
                       id="g1982">
                      <g
                         id="g1984"
                         clip-path="url(#clipPath1988)">
                        <g
                           id="g1990">
                          <g
                             id="g1992"
                             transform="scale(1,-1)">
                            <path
                               d="m 760.125,-313.16 h -6"
                               style="fill:none;stroke:#000000;stroke-width:1;stroke-linecap:butt;stroke-linejoin:round;stroke-miterlimit:10;stroke-dasharray:none;stroke-opacity:1"
                               id="path1994" />
                          </g>
                        </g>
                      </g>
                    </g>
                  </g>
                </g>
              </g>
              <g
                 id="g1996">
                <g
                   id="g1998"
                   clip-path="url(#clipPath2002)">
                  <g
                     id="g2004">
                    <g
                       id="g2006">
                      <g
                         id="g2008"
                         clip-path="url(#clipPath2012)">
                        <g
                           id="g2014">
                          <g
                             id="g2016"
                             transform="scale(1,-1)">
                            <path
                               d="m 807.598,-313.254 h -6"
                               style="fill:none;stroke:#000000;stroke-width:1;stroke-linecap:butt;stroke-linejoin:round;stroke-miterlimit:10;stroke-dasharray:none;stroke-opacity:1"
                               id="path2018" />
                          </g>
                        </g>
                      </g>
                    </g>
                  </g>
                </g>
              </g>
            </g>
          </g>
        </g>
      </g>
    </g>
    <g
       id="g2020">
      <g
         id="g2022"
         transform="scale(1,-1)">
        <path
           d="M 484.637,-393.539 V -60.898"
           style="fill:none;stroke:#000000;stroke-width:0.8;stroke-linecap:square;stroke-linejoin:miter;stroke-miterlimit:10;stroke-dasharray:none;stroke-opacity:1"
           id="path2024" />
      </g>
      <g
         id="g2026"
         transform="scale(1,-1)">
        <path
           d="M 839.727,-393.539 V -60.898"
           style="fill:none;stroke:#000000;stroke-width:0.8;stroke-linecap:square;stroke-linejoin:miter;stroke-miterlimit:10;stroke-dasharray:none;stroke-opacity:1"
           id="path2028" />
      </g>
      <g
         id="g2030"
         transform="scale(1,-1)">
        <path
           d="m 484.637,-393.539 h 355.09"
           style="fill:none;stroke:#000000;stroke-width:0.8;stroke-linecap:square;stroke-linejoin:miter;stroke-miterlimit:10;stroke-dasharray:none;stroke-opacity:1"
           id="path2032" />
      </g>
      <g
         id="g2034"
         transform="scale(1,-1)">
        <path
           d="m 484.637,-60.898 h 355.09"
           style="fill:none;stroke:#000000;stroke-width:0.8;stroke-linecap:square;stroke-linejoin:miter;stroke-miterlimit:10;stroke-dasharray:none;stroke-opacity:1"
           id="path2036" />
      </g>
      <text
         xml:space="preserve"
         transform="translate(494.0009,82.679248)"
         style="font-variant:normal;font-weight:normal;font-size:18px;font-family:'DejaVu Sans';-inkscape-font-specification:DejaVuSans;writing-mode:lr-tb;fill:#000000;fill-opacity:1;fill-rule:nonzero;stroke:none"
         id="text2056"><tspan
           x="0 11.448 22.896 34.344002 40.049999"
           y="0"
           sodipodi:role="line"
           id="tspan2038">313.3</tspan><tspan
           x="47.47205 58.920048 70.36805 81.816048 87.522049"
           y="105.08362"
           sodipodi:role="line"
           id="tspan2040">204.8</tspan><tspan
           x="94.944099 106.3921 117.8401 129.2881 134.99409"
           y="177.09818"
           sodipodi:role="line"
           id="tspan2042">127.4</tspan><tspan
           x="148.1427 159.5907 171.0387 176.74471"
           y="212.79796"
           sodipodi:role="line"
           id="tspan2044">93.6</tspan><tspan
           x="195.61475 207.06274 218.51074 224.21675"
           y="221.85542"
           sodipodi:role="line"
           id="tspan2046">84.9</tspan><tspan
           x="243.08679 254.53479 265.98279 271.68878"
           y="223.53905"
           sodipodi:role="line"
           id="tspan2048">83.6</tspan><tspan
           x="290.55884 302.00684 313.45483 319.16086"
           y="223.63181"
           sodipodi:role="line"
           id="tspan2050">83.5</tspan><tspan
           x="105.25207 114.97207 125.97006 136.96806 146.32806 157.39807 163.10406 177.27007 188.68207 193.66806 204.73807 214.62007 221.67607"
           y="-27.779251"
           sodipodi:role="line"
           id="tspan2052">Loose Objects</tspan><tspan
           x="-80.271217 -65.565216 -54.567215 -47.169216 -37.395218 -26.325216 -18.927216"
           y="345.2045"
           sodipodi:role="line"
           id="tspan2054">workers</tspan></text>
      <text
         xml:space="preserve"
         transform="translate(188.02813,22.403124)"
         style="font-variant:normal;font-weight:normal;font-size:20px;font-family:'DejaVu Sans';-inkscape-font-specification:DejaVuSans;writing-mode:lr-tb;fill:#000000;fill-opacity:1;fill-rule:nonzero;stroke:none"
         id="text2060"><tspan
           x="0 17.24 29.48 40.459999 53.119999 58.66 71.32 83.620003 89.959999 107.2 119.44 132.10001 144.78 157 163.34 170.53999 176.88 189.56 202.24001 217.64 223.98 231.17999"
           y="0"
           sodipodi:role="line"
           id="tspan2058">Machine Mango - SSD - </tspan></text>
      <text
         xml:space="preserve"
         transform="translate(425.54812,22.403124)"
         style="font-variant:normal;font-weight:bold;font-size:20px;font-family:'DejaVu Sans';-inkscape-font-specification:DejaVuSans-Bold;writing-mode:lr-tb;fill:#000000;fill-opacity:1;fill-rule:nonzero;stroke:none"
         id="text2064"><tspan
           x="0 22.059999 28.9 43.119999 57.419998 71.160004 89.620003 108.46 122.36"
           y="0"
           sodipodi:role="line"
           id="tspan2062">Windows10</tspan></text>
      <text
         xml:space="preserve"
         transform="translate(568.16812,22.403124)"
         style="font-variant:normal;font-weight:normal;font-size:20px;font-family:'DejaVu Sans';-inkscape-font-specification:DejaVuSans;writing-mode:lr-tb;fill:#000000;fill-opacity:1;fill-rule:nonzero;stroke:none"
         id="text2068"><tspan
           x="0 7.8000002 13.34 18.879999 31.540001 44.200001 56.02 62.360001 70.580002 82.879997 95.559998 107.78"
           y="0"
           sodipodi:role="line"
           id="tspan2066">(linux repo)</tspan></text>
      <text
         xml:space="preserve"
         transform="translate(142.52999,53.430001)"
         style="font-variant:normal;font-weight:normal;font-size:18px;font-family:'Noto Sans';-inkscape-font-specification:NotoSans-Regular;writing-mode:lr-tb;fill:#000000;fill-opacity:1;fill-rule:nonzero;stroke:none"
         id="text2072"><tspan
           x="0 5.4000001 15.498 430.85812 436.25812 447.32812"
           y="0"
           sodipodi:role="line"
           id="tspan2070">(a)(b)</tspan></text>
    </g>
  </g>
</svg>
