(footprint "WEMOS_D1_mini_light" (version 20211014) (generator pcbnew)
  (layer "F.Cu")
  (tedit 61F58A7F)
  (descr "16-pin module, column spacing 22.86 mm (900 mils), https://wiki.wemos.cc/products:d1:d1_mini, https://c1.staticflickr.com/1/734/31400410271_f278b087db_z.jpg")
  (tags "ESP8266 WiFi microcontroller")
  (property "Sheetfile" "acesrg_motor_encoder_controller.kicad_sch")
  (property "Sheetname" "")
  (clearance 0.2)
  (attr through_hole)
  (fp_text reference "U1" (at 22 27) (layer "F.SilkS")
    (effects (font (size 1 1) (thickness 0.15)))
    (tstamp 75ba0998-440d-4dc8-b0f1-e3a410839373)
  )
  (fp_text value "ESP8266_D1_mini" (at 11.7 0) (layer "F.Fab")
    (effects (font (size 1 1) (thickness 0.15)))
    (tstamp 1cecea26-9922-4591-981b-68123c3137a8)
  )
  (fp_text user "No copper" (at 11.43 -3.81) (layer "Cmts.User")
    (effects (font (size 1 1) (thickness 0.15)))
    (tstamp e9db1ca1-f071-4f35-8749-1687285837e6)
  )
  (fp_text user "KEEP OUT" (at 11.43 -6.35) (layer "Cmts.User")
    (effects (font (size 1 1) (thickness 0.15)))
    (tstamp f6d67138-57e3-4250-864c-bde4bc8604e8)
  )
  (fp_text user "${REFERENCE}" (at 11.43 10) (layer "F.Fab")
    (effects (font (size 1 1) (thickness 0.15)))
    (tstamp 74fdb984-fb9e-4276-b326-b9ba1378f406)
  )
  (fp_line (start -1.5 19.22) (end -1.5 -6.21) (layer "F.SilkS") (width 0.12) (tstamp 00e8b1c2-3e4c-4c76-b553-483841b4e80c))
  (fp_line (start 1.04 26.12) (end 24.36 26.12) (layer "F.SilkS") (width 0.12) (tstamp 11f2b003-adf3-458d-9fac-8bff86a8ab77))
  (fp_line (start -1.5 19.22) (end 1.04 19.22) (layer "F.SilkS") (width 0.12) (tstamp 3779a9ea-dd46-415f-ae6a-2d3caafca7c2))
  (fp_line (start 1.04 19.22) (end 1.04 26.12) (layer "F.SilkS") (width 0.12) (tstamp 3fa7f8f0-1a95-43d1-87ff-82f1a11f73d5))
  (fp_line (start 22.24 -8.34) (end 0.63 -8.34) (layer "F.SilkS") (width 0.12) (tstamp c589e020-7354-41f7-893f-0f63909adcd2))
  (fp_line (start 24.36 26.12) (end 24.36 -6.21) (layer "F.SilkS") (width 0.12) (tstamp e706949c-a182-4da1-88c5-281a65591486))
  (fp_arc (start -1.5 -6.21) (mid -0.876137 -7.716137) (end 0.63 -8.34) (layer "F.SilkS") (width 0.12) (tstamp 0fc178c7-04cf-4e41-81b5-192ae8c6a5b4))
  (fp_arc (start 22.23 -8.34) (mid 23.736137 -7.716137) (end 24.36 -6.21) (layer "F.SilkS") (width 0.12) (tstamp 9bb42f18-27cd-4b48-8f1f-0ea9b169386f))
  (fp_poly (pts
      (xy -2.54 -0.635)
      (xy -2.54 0.635)
      (xy -1.905 0)
    ) (layer "F.SilkS") (width 0.15) (fill solid) (tstamp 0e785cda-5177-4a92-8ed9-3b364cb4aa52))
  (fp_line (start 20.65 -1.4) (end 24.25 -5) (layer "Dwgs.User") (width 0.1) (tstamp 0521a9d7-366c-4bb7-926a-57eaf1e89a49))
  (fp_line (start -1.35 -1.4) (end 5.45 -8.2) (layer "Dwgs.User") (width 0.1) (tstamp 284b1ed6-322b-4421-b371-f101db986ef8))
  (fp_line (start 18.65 -1.4) (end 24.25 -7) (layer "Dwgs.User") (width 0.1) (tstamp 58e35479-8c2b-406d-9c90-79f02263a7fb))
  (fp_line (start 4.65 -1.4) (end 11.45 -8.2) (layer "Dwgs.User") (width 0.1) (tstamp 60faec74-1dc8-4156-a89a-a495734ce3b8))
  (fp_line (start 12.65 -1.4) (end 19.45 -8.2) (layer "Dwgs.User") (width 0.1) (tstamp 63a6619c-b89d-41db-8632-b09748544717))
  (fp_line (start 2.65 -1.4) (end 9.45 -8.2) (layer "Dwgs.User") (width 0.1) (tstamp 6a843c2b-c82e-49bb-930f-3e53ff3b5db7))
  (fp_line (start -1.35 -7.4) (end -0.55 -8.2) (layer "Dwgs.User") (width 0.1) (tstamp 75165936-2103-4426-980e-95fd93fa9746))
  (fp_line (start -1.35 -8.2) (end -1.35 -1.4) (layer "Dwgs.User") (width 0.1) (tstamp 7ad561af-13a4-4fd0-af69-e7c0ee512e81))
  (fp_line (start -1.35 -3.4) (end 3.45 -8.2) (layer "Dwgs.User") (width 0.1) (tstamp 8170ff07-129b-47fa-81a0-a4d37b01b26a))
  (fp_line (start 14.65 -1.4) (end 21.45 -8.2) (layer "Dwgs.User") (width 0.1) (tstamp 82f9b9fa-caa4-4b09-a61f-cfedb89a7359))
  (fp_line (start 10.65 -1.4) (end 17.45 -8.2) (layer "Dwgs.User") (width 0.1) (tstamp 9cf96b6b-3398-4057-b3c7-8997b0fcc31f))
  (fp_line (start -1.35 -1.4) (end 24.25 -1.4) (layer "Dwgs.User") (width 0.1) (tstamp a3ba7100-2d4b-49db-aeef-dd97f1be2c40))
  (fp_line (start 24.25 -1.4) (end 24.25 -8.2) (layer "Dwgs.User") (width 0.1) (tstamp b3796c41-76fd-4da2-a64a-0b51f277ae74))
  (fp_line (start 16.65 -1.4) (end 23.45 -8.2) (layer "Dwgs.User") (width 0.1) (tstamp b8f22601-f4b9-444f-ad74-032c932bc287))
  (fp_line (start 8.65 -1.4) (end 15.45 -8.2) (layer "Dwgs.User") (width 0.1) (tstamp c0252709-36c1-4a90-baef-82a58fd0f514))
  (fp_line (start 24.25 -8.2) (end -1.35 -8.2) (layer "Dwgs.User") (width 0.1) (tstamp c65096ba-9d25-4cd8-9d3d-14e30cecce87))
  (fp_line (start 0.65 -1.4) (end 7.45 -8.2) (layer "Dwgs.User") (width 0.1) (tstamp cbb658ca-2e87-488f-a325-728f06fd1f0b))
  (fp_line (start -1.3 -5.45) (end 1.45 -8.2) (layer "Dwgs.User") (width 0.1) (tstamp d9d38f40-97d4-4e6a-a99c-9746c994009e))
  (fp_line (start 6.65 -1.4) (end 13.45 -8.2) (layer "Dwgs.User") (width 0.1) (tstamp da275c76-e8f6-4cc2-b28e-cce9d8a24e53))
  (fp_line (start 22.65 -1.4) (end 24.25 -3) (layer "Dwgs.User") (width 0.1) (tstamp ea1d4cb4-2cf1-4eb2-b934-c22df26caa07))
  (fp_line (start -1.62 -8.46) (end 24.48 -8.46) (layer "F.CrtYd") (width 0.05) (tstamp 1cb74740-d363-4a62-b730-7c27343a4d6e))
  (fp_line (start -1.62 26.24) (end -1.62 -8.46) (layer "F.CrtYd") (width 0.05) (tstamp 78335814-b4fb-40fb-ae8d-b0bdf1ce9f6a))
  (fp_line (start 24.48 26.24) (end -1.62 26.24) (layer "F.CrtYd") (width 0.05) (tstamp c3efa31c-1cd4-4d26-b0ed-4c65c6726e15))
  (fp_line (start 24.48 -8.46) (end 24.48 26.24) (layer "F.CrtYd") (width 0.05) (tstamp c547bcce-0eaf-4178-acd1-879bdbba15df))
  (fp_line (start -1.37 1) (end -1.37 19.09) (layer "F.Fab") (width 0.1) (tstamp 1b5cac98-c2a2-472f-bba8-b90bab8fd9c5))
  (fp_line (start 22.23 -8.21) (end 0.63 -8.21) (layer "F.Fab") (width 0.1) (tstamp 2227d9c4-1b94-45aa-860d-5480fc01ca83))
  (fp_line (start 1.17 19.09) (end 1.17 25.99) (layer "F.Fab") (width 0.1) (tstamp 4dfae405-9724-481d-a657-8bed9ba0472e))
  (fp_line (start 24.23 25.99) (end 24.23 -6.21) (layer "F.Fab") (width 0.1) (tstamp 8c02797d-071f-45e8-a7a5-c35be3a2c638))
  (fp_line (start -1.37 19.09) (end 1.17 19.09) (layer "F.Fab") (width 0.1) (tstamp 8e782605-6037-4814-ba6a-06524c344dbf))
  (fp_line (start -0.37 0) (end -1.37 -1) (layer "F.Fab") (width 0.1) (tstamp bc6ece28-01f2-4fc7-bb0d-d08a333132b7))
  (fp_line (start 1.17 25.99) (end 24.23 25.99) (layer "F.Fab") (width 0.1) (tstamp bf5538f1-8343-47c9-8df1-ef7bb018d11c))
  (fp_line (start -1.37 1) (end -0.37 0) (layer "F.Fab") (width 0.1) (tstamp dc3ddbf1-bcbe-4279-80e2-be7cd6fe0c66))
  (fp_line (start -1.37 -6.21) (end -1.37 -1) (layer "F.Fab") (width 0.1) (tstamp e02b83f1-85a1-4366-a060-69022da18ceb))
  (fp_arc (start 22.25 -8.21) (mid 23.658356 -7.610071) (end 24.23 -6.19) (layer "F.Fab") (width 0.1) (tstamp 31f032dc-39eb-43ff-bb52-164d5475c6da))
  (fp_arc (start -1.37 -6.21) (mid -0.784214 -7.624214) (end 0.63 -8.21) (layer "F.Fab") (width 0.1) (tstamp 547e9c52-87c7-4c8d-bbdd-d90b14d27a85))
  (pad "1" thru_hole rect (at 0 0) (size 2.1 1.8) (drill 0.25) (layers *.Cu *.Mask) (tstamp 556c93c2-1449-4ad6-bc92-7062407f65e7))
  (pad "2" thru_hole oval (at 0 2.54) (size 2.1 1.8) (drill 0.25) (layers *.Cu *.Mask) (tstamp 0ba1a399-222c-4949-bfdd-8693ac54dfd5))
  (pad "3" thru_hole oval (at 0 5.08) (size 2.1 1.8) (drill 0.25) (layers *.Cu *.Mask) (tstamp b0a93a9e-cef4-4a02-95ea-3d7bd1432043))
  (pad "4" thru_hole oval (at 0 7.62) (size 2.1 1.8) (drill 0.25) (layers *.Cu *.Mask) (tstamp f5ac89c0-3bef-401f-a117-f66b1b454eac))
  (pad "5" thru_hole oval (at 0 10.16) (size 2.1 1.8) (drill 0.25) (layers *.Cu *.Mask) (tstamp f4499a14-c481-4c5a-aabe-79e4aedd6a19))
  (pad "6" thru_hole oval (at 0 12.7) (size 2.1 1.8) (drill 0.25) (layers *.Cu *.Mask) (tstamp 2921f120-5717-42ad-b55d-292001ea738c))
  (pad "7" thru_hole oval (at 0 15.24) (size 2.1 1.8) (drill 0.25) (layers *.Cu *.Mask) (tstamp fa9c04f4-b94e-4e6f-9bd1-0d9ae918420d))
  (pad "8" thru_hole oval (at 0 17.78) (size 2.1 1.8) (drill 0.25) (layers *.Cu *.Mask) (tstamp 44687713-dc87-43f3-a990-e4ea44390d60))
  (pad "9" thru_hole oval (at 22.86 17.78) (size 2.1 1.8) (drill 0.25) (layers *.Cu *.Mask) (tstamp a227b395-d2c3-49b7-8235-2638553553ae))
  (pad "10" thru_hole oval (at 22.86 15.24) (size 2.1 1.8) (drill 0.25) (layers *.Cu *.Mask) (tstamp 08087698-4b34-4c74-9894-7743ff0db631))
  (pad "11" thru_hole oval (at 22.86 12.7) (size 2.1 1.8) (drill 0.25) (layers *.Cu *.Mask) (tstamp 74f46fef-5fbd-4518-a2e4-005586ec7db8))
  (pad "12" thru_hole oval (at 22.86 10.16) (size 2.1 1.8) (drill 0.25) (layers *.Cu *.Mask) (tstamp b126f448-1970-45cc-b0b9-0c4e31476856))
  (pad "13" thru_hole oval (at 22.86 7.62) (size 2.1 1.8) (drill 0.25) (layers *.Cu *.Mask) (tstamp d916ee4c-f885-4879-b876-1e2ea611e9d9))
  (pad "14" thru_hole oval (at 22.86 5.08) (size 2.1 1.8) (drill 0.25) (layers *.Cu *.Mask) (tstamp 2a0347ed-a3d1-4de6-bb93-9b6606b53bc2))
  (pad "15" thru_hole oval (at 22.86 2.54) (size 2.1 1.8) (drill 0.25) (layers *.Cu *.Mask) (tstamp 1883a394-8896-497b-95f6-bfad1d1ab9af))
  (pad "16" thru_hole oval (at 22.86 0) (size 2.1 1.8) (drill 0.25) (layers *.Cu *.Mask) (tstamp e2e16959-781e-4b50-9466-fb978dafa4d6))
  (model "/home/sp/.local/share/kicad/6.0/projects/acesrg_motor_encoder_controller/Library.pretty/ESP8266_D1_mini.step"
    (offset (xyz -1 -26.7 4))
    (scale (xyz 1 1 1))
    (rotate (xyz 0 0 0))
  )
)
