(footprint "PinHeader_1x05_P2.54mm_Vertical" (version 20211014) (generator pcbnew)
  (layer "F.Cu")
  (tedit 59FED5CC)
  (descr "Through hole straight pin header, 1x05, 2.54mm pitch, single row")
  (tags "Through hole pin header THT 1x05 2.54mm single row")
  (property "Sheetfile" "acesrg_motor_encoder_controller.kicad_sch")
  (property "Sheetname" "")
  (attr through_hole)
  (fp_text reference "J1" (at 0.0254 12.7712 90) (layer "F.SilkS")
    (effects (font (size 1 1) (thickness 0.15)))
    (tstamp 34e3564d-52f5-472e-933f-0a0641f3ae7a)
  )
  (fp_text value "motor_dc" (at 0 12.49 180) (layer "F.Fab")
    (effects (font (size 1 1) (thickness 0.15)))
    (tstamp 53b4aa89-0e34-49f7-a57f-11587ddcbcbe)
  )
  (fp_text user "${REFERENCE}" (at 0 5.08 90) (layer "F.Fab")
    (effects (font (size 1 1) (thickness 0.15)))
    (tstamp 2252a10e-7d6e-444d-8d21-90bf1f545207)
  )
  (fp_line (start -1.33 11.49) (end 1.33 11.49) (layer "F.SilkS") (width 0.12) (tstamp 16594f06-54f7-4271-8938-d687caa1c15d))
  (fp_line (start -1.33 1.27) (end -1.33 11.49) (layer "F.SilkS") (width 0.12) (tstamp 45aeaad7-361f-46c6-bcda-442df799ab2c))
  (fp_line (start 1.33 1.27) (end 1.33 11.49) (layer "F.SilkS") (width 0.12) (tstamp 80581089-89bd-4d18-b364-e7ffc09406e8))
  (fp_line (start -1.33 -1.33) (end 0 -1.33) (layer "F.SilkS") (width 0.12) (tstamp 88e6d9cc-fb3a-4a2d-b45e-fd628eb41a8e))
  (fp_line (start -1.33 0) (end -1.33 -1.33) (layer "F.SilkS") (width 0.12) (tstamp 9f13dd42-db09-41b5-a9b4-595822b0f123))
  (fp_line (start -1.33 1.27) (end 1.33 1.27) (layer "F.SilkS") (width 0.12) (tstamp b29429c2-642e-41bd-9db6-497e7ea45f38))
  (fp_line (start 1.8 11.95) (end 1.8 -1.8) (layer "F.CrtYd") (width 0.05) (tstamp 15284c90-62a1-435c-aa8a-1cc11d8f2427))
  (fp_line (start 1.8 -1.8) (end -1.8 -1.8) (layer "F.CrtYd") (width 0.05) (tstamp 98a98d8f-f59e-4c0a-83a2-38a640d7abf7))
  (fp_line (start -1.8 11.95) (end 1.8 11.95) (layer "F.CrtYd") (width 0.05) (tstamp a81ebfd9-e266-4597-b689-8f6799a2a5bf))
  (fp_line (start -1.8 -1.8) (end -1.8 11.95) (layer "F.CrtYd") (width 0.05) (tstamp bd1bccdc-c2a7-44c2-8d25-f605fc9c21c6))
  (fp_line (start -0.635 -1.27) (end 1.27 -1.27) (layer "F.Fab") (width 0.1) (tstamp 0f83b7e5-5765-4b50-9277-b2f64d60c7fd))
  (fp_line (start -1.27 11.43) (end -1.27 -0.635) (layer "F.Fab") (width 0.1) (tstamp 1d2e814d-84df-4501-b99c-4b6a6aa99513))
  (fp_line (start 1.27 11.43) (end -1.27 11.43) (layer "F.Fab") (width 0.1) (tstamp 84c69163-cfc8-4ccd-ad60-b908ffb198a1))
  (fp_line (start 1.27 -1.27) (end 1.27 11.43) (layer "F.Fab") (width 0.1) (tstamp 8d8543de-a91b-465f-965c-8d2f6c8365f5))
  (fp_line (start -1.27 -0.635) (end -0.635 -1.27) (layer "F.Fab") (width 0.1) (tstamp b7157bcd-88b1-49ee-87cb-2dc2cd70d0f6))
  (pad "1" thru_hole rect (at 0 0) (size 1.7 1.7) (drill 0.25) (layers *.Cu *.Mask) (tstamp acdd6f2a-cc47-4f74-bc6d-c9d6405dcf84))
  (pad "2" thru_hole oval (at 0 2.54) (size 1.7 1.7) (drill 0.25) (layers *.Cu *.Mask) (tstamp 5f93adac-4da2-4b5c-acd5-d874d67d1f69))
  (pad "3" thru_hole oval (at 0 5.08 90) (size 1.7 1.7) (drill 0.25) (layers *.Cu *.Mask) (tstamp 54ef0e43-b12c-4ad9-ad69-5a546dfe2be2))
  (pad "4" thru_hole oval (at 0 7.62) (size 1.7 1.7) (drill 0.25) (layers *.Cu *.Mask) (tstamp 8128414a-ee45-4713-afae-18461b538348))
  (pad "5" thru_hole oval (at 0 10.16) (size 1.7 1.7) (drill 0.25) (layers *.Cu *.Mask) (tstamp 5abf6086-5642-4983-8706-0a081fa5da8f))
)
