(kicad_symbol_lib (version 20210619) (generator bitmap2component)
  (symbol "LOGO" (pin_names (offset 1.016)) (in_bom yes) (on_board yes)
    (property "Reference" "#G" (id 0) (at 0 4.27847 0)
      (effects (font (size 1.27 1.27)) hide)
    )
    (property "Value" "LOGO" (id 1) (at 0 -4.27847 0)
      (effects (font (size 1.27 1.27)) hide)
    )
    (property "Footprint" "" (id 2) (at 0 0 0)
      (effects (font (size 1.27 1.27)) hide)
    )
    (property "Datasheet" "" (id 3) (at 0 0 0)
      (effects (font (size 1.27 1.27)) hide)
    )
    (symbol "LOGO_0_0"
      (polyline
        (pts
          (xy -2.582300 -4.906900)
          (xy -2.506000 -4.894600)
          (xy -2.437400 -4.876100)
          (xy -2.417400 -4.868900)
          (xy -2.361100 -4.843200)
          (xy -2.312200 -4.812900)
          (xy -2.271900 -4.779200)
          (xy -2.241600 -4.743300)
          (xy -2.222600 -4.706300)
          (xy -2.215900 -4.669300)
          (xy -2.217900 -4.649700)
          (xy -2.230500 -4.617200)
          (xy -2.252500 -4.590100)
          (xy -2.281400 -4.569900)
          (xy -2.314500 -4.558200)
          (xy -2.349300 -4.556700)
          (xy -2.383100 -4.566900)
          (xy -2.397400 -4.575800)
          (xy -2.418400 -4.591900)
          (xy -2.439700 -4.610500)
          (xy -2.455200 -4.624200)
          (xy -2.483600 -4.644300)
          (xy -2.514500 -4.658900)
          (xy -2.550600 -4.668700)
          (xy -2.594800 -4.674800)
          (xy -2.649800 -4.677900)
          (xy -2.658800 -4.678200)
          (xy -2.701900 -4.678900)
          (xy -2.735400 -4.677800)
          (xy -2.762800 -4.674800)
          (xy -2.787500 -4.669800)
          (xy -2.838900 -4.653300)
          (xy -2.894800 -4.625100)
          (xy -2.939700 -4.588800)
          (xy -2.961700 -4.563000)
          (xy -2.980400 -4.531900)
          (xy -2.993200 -4.495800)
          (xy -3.001300 -4.451900)
          (xy -3.005500 -4.397400)
          (xy -3.006300 -4.369600)
          (xy -3.004000 -4.297300)
          (xy -2.994300 -4.235200)
          (xy -2.976900 -4.182300)
          (xy -2.951500 -4.137100)
          (xy -2.917700 -4.098500)
          (xy -2.879000 -4.068400)
          (xy -2.825200 -4.041100)
          (xy -2.766600 -4.024900)
          (xy -2.705100 -4.019900)
          (xy -2.642900 -4.026200)
          (xy -2.581800 -4.044100)
          (xy -2.523900 -4.073500)
          (xy -2.520100 -4.076000)
          (xy -2.504300 -4.087400)
          (xy -2.493900 -4.099600)
          (xy -2.485800 -4.116700)
          (xy -2.477300 -4.142900)
          (xy -2.461000 -4.185300)
          (xy -2.439600 -4.217300)
          (xy -2.431800 -4.225700)
          (xy -2.420800 -4.235200)
          (xy -2.409000 -4.240300)
          (xy -2.392000 -4.242200)
          (xy -2.365600 -4.242500)
          (xy -2.364200 -4.242500)
          (xy -2.336900 -4.241900)
          (xy -2.318400 -4.239200)
          (xy -2.303900 -4.233200)
          (xy -2.288600 -4.222700)
          (xy -2.281200 -4.216800)
          (xy -2.268300 -4.204700)
          (xy -2.258700 -4.191000)
          (xy -2.252000 -4.173800)
          (xy -2.247500 -4.151000)
          (xy -2.244900 -4.120600)
          (xy -2.243700 -4.080500)
          (xy -2.243400 -4.028700)
          (xy -2.243500 -4.004300)
          (xy -2.244200 -3.957600)
          (xy -2.246100 -3.921700)
          (xy -2.249800 -3.894700)
          (xy -2.255700 -3.874600)
          (xy -2.264300 -3.859400)
          (xy -2.276100 -3.847100)
          (xy -2.291600 -3.835700)
          (xy -2.298000 -3.831900)
          (xy -2.323800 -3.821200)
          (xy -2.350700 -3.815100)
          (xy -2.373900 -3.814000)
          (xy -2.394200 -3.818200)
          (xy -2.417900 -3.829200)
          (xy -2.451300 -3.847200)
          (xy -2.493600 -3.830400)
          (xy -2.528400 -3.817200)
          (xy -2.572200 -3.803800)
          (xy -2.614500 -3.795400)
          (xy -2.660400 -3.791100)
          (xy -2.714800 -3.790000)
          (xy -2.745800 -3.790500)
          (xy -2.805600 -3.794900)
          (xy -2.858400 -3.804700)
          (xy -2.908400 -3.820700)
          (xy -2.960100 -3.843800)
          (xy -2.977600 -3.853000)
          (xy -3.048500 -3.899300)
          (xy -3.109300 -3.954900)
          (xy -3.159800 -4.019400)
          (xy -3.199600 -4.092600)
          (xy -3.228600 -4.174100)
          (xy -3.230100 -4.180100)
          (xy -3.236500 -4.216000)
          (xy -3.241200 -4.261000)
          (xy -3.244100 -4.312000)
          (xy -3.245300 -4.365700)
          (xy -3.244700 -4.418800)
          (xy -3.242300 -4.468000)
          (xy -3.238100 -4.510100)
          (xy -3.232000 -4.541900)
          (xy -3.226800 -4.559100)
          (xy -3.196600 -4.632300)
          (xy -3.154900 -4.698600)
          (xy -3.102700 -4.757400)
          (xy -3.040800 -4.808000)
          (xy -2.970100 -4.849700)
          (xy -2.891300 -4.881700)
          (xy -2.805400 -4.903300)
          (xy -2.738500 -4.911300)
          (xy -2.661300 -4.912600)
          (xy -2.582300 -4.906900)
        )
        (stroke (width 0.01)) (fill (type outline))
      )
      (polyline
        (pts
          (xy -1.644100 -4.910100)
          (xy -1.596000 -4.904300)
          (xy -1.554600 -4.895400)
          (xy -1.523200 -4.883800)
          (xy -1.512500 -4.878700)
          (xy -1.502400 -4.877600)
          (xy -1.494000 -4.884100)
          (xy -1.483600 -4.888800)
          (xy -1.461900 -4.892000)
          (xy -1.432600 -4.893200)
          (xy -1.398700 -4.892500)
          (xy -1.363300 -4.890100)
          (xy -1.329600 -4.886200)
          (xy -1.300600 -4.880800)
          (xy -1.279400 -4.874200)
          (xy -1.264800 -4.866700)
          (xy -1.238400 -4.844000)
          (xy -1.223100 -4.813500)
          (xy -1.218100 -4.774300)
          (xy -1.220000 -4.751200)
          (xy -1.232700 -4.715800)
          (xy -1.256800 -4.688000)
          (xy -1.291500 -4.668700)
          (xy -1.303900 -4.664100)
          (xy -1.319700 -4.658000)
          (xy -1.326800 -4.655000)
          (xy -1.326300 -4.650000)
          (xy -1.322300 -4.635100)
          (xy -1.315600 -4.614200)
          (xy -1.313800 -4.608900)
          (xy -1.304000 -4.586200)
          (xy -1.292600 -4.571400)
          (xy -1.275800 -4.559900)
          (xy -1.268000 -4.555000)
          (xy -1.241900 -4.529400)
          (xy -1.224600 -4.496200)
          (xy -1.218200 -4.459300)
          (xy -1.223000 -4.426600)
          (xy -1.240000 -4.394700)
          (xy -1.270000 -4.365700)
          (xy -1.280300 -4.358200)
          (xy -1.291000 -4.352500)
          (xy -1.303900 -4.348700)
          (xy -1.321900 -4.346300)
          (xy -1.347800 -4.344700)
          (xy -1.384700 -4.343400)
          (xy -1.415400 -4.342700)
          (xy -1.449700 -4.343000)
          (xy -1.471600 -4.345000)
          (xy -1.481700 -4.348500)
          (xy -1.482000 -4.348900)
          (xy -1.488000 -4.360000)
          (xy -1.495800 -4.380000)
          (xy -1.503800 -4.404900)
          (xy -1.518100 -4.453300)
          (xy -1.601200 -4.337600)
          (xy -1.601700 -4.336900)
          (xy -1.638200 -4.285500)
          (xy -1.666700 -4.243800)
          (xy -1.687800 -4.210400)
          (xy -1.701900 -4.184100)
          (xy -1.709500 -4.163600)
          (xy -1.711100 -4.147800)
          (xy -1.707000 -4.135200)
          (xy -1.697900 -4.124700)
          (xy -1.684100 -4.115000)
          (xy -1.671200 -4.108100)
          (xy -1.647500 -4.101400)
          (xy -1.623400 -4.104200)
          (xy -1.596500 -4.117200)
          (xy -1.564200 -4.140900)
          (xy -1.552300 -4.149900)
          (xy -1.536300 -4.159500)
          (xy -1.526400 -4.162200)
          (xy -1.520600 -4.160000)
          (xy -1.504300 -4.152200)
          (xy -1.480900 -4.140600)
          (xy -1.453500 -4.126400)
          (xy -1.440200 -4.119300)
          (xy -1.404100 -4.097700)
          (xy -1.378900 -4.077400)
          (xy -1.363000 -4.056600)
          (xy -1.354700 -4.033200)
          (xy -1.352300 -4.005100)
          (xy -1.352300 -4.003100)
          (xy -1.353900 -3.977800)
          (xy -1.359900 -3.959000)
          (xy -1.372200 -3.940100)
          (xy -1.378700 -3.932200)
          (xy -1.410300 -3.906500)
          (xy -1.448000 -3.892500)
          (xy -1.489400 -3.891200)
          (xy -1.494600 -3.891800)
          (xy -1.523200 -3.892100)
          (xy -1.545400 -3.887800)
          (xy -1.554300 -3.884600)
          (xy -1.609500 -3.872600)
          (xy -1.667200 -3.872400)
          (xy -1.724900 -3.883300)
          (xy -1.780500 -3.904200)
          (xy -1.831600 -3.934500)
          (xy -1.875900 -3.973300)
          (xy -1.911100 -4.019800)
          (xy -1.923700 -4.042700)
          (xy -1.944900 -4.099800)
          (xy -1.952400 -4.157500)
          (xy -1.946200 -4.215600)
          (xy -1.926200 -4.273900)
          (xy -1.917900 -4.292100)
          (xy -1.910600 -4.309800)
          (xy -1.908300 -4.320200)
          (xy -1.910600 -4.326000)
          (xy -1.916900 -4.330200)
          (xy -1.920000 -4.331900)
          (xy -1.942800 -4.349500)
          (xy -1.968600 -4.375500)
          (xy -1.994500 -4.406800)
          (xy -2.017800 -4.439900)
          (xy -2.035700 -4.471500)
          (xy -2.045000 -4.491400)
          (xy -2.052700 -4.510100)
          (xy -2.057500 -4.527200)
          (xy -2.059900 -4.546500)
          (xy -2.060900 -4.571900)
          (xy -2.061100 -4.607200)
          (xy -2.061000 -4.628700)
          (xy -1.822500 -4.628700)
          (xy -1.822200 -4.600100)
          (xy -1.822100 -4.598900)
          (xy -1.818400 -4.573900)
          (xy -1.810500 -4.555800)
          (xy -1.795900 -4.538200)
          (xy -1.788100 -4.530400)
          (xy -1.775500 -4.518900)
          (xy -1.768900 -4.514300)
          (xy -1.768700 -4.514400)
          (xy -1.763000 -4.520400)
          (xy -1.751400 -4.535100)
          (xy -1.735600 -4.556000)
          (xy -1.717300 -4.580600)
          (xy -1.698400 -4.606700)
          (xy -1.680600 -4.631600)
          (xy -1.665700 -4.653000)
          (xy -1.655400 -4.668400)
          (xy -1.651600 -4.675500)
          (xy -1.651700 -4.675700)
          (xy -1.658800 -4.678300)
          (xy -1.675800 -4.679400)
          (xy -1.699100 -4.679400)
          (xy -1.725400 -4.678300)
          (xy -1.750900 -4.676200)
          (xy -1.772200 -4.673400)
          (xy -1.785800 -4.670000)
          (xy -1.802100 -4.661600)
          (xy -1.816500 -4.648000)
          (xy -1.822500 -4.628700)
          (xy -2.061000 -4.628700)
          (xy -2.061000 -4.630900)
          (xy -2.060400 -4.659900)
          (xy -2.058500 -4.681300)
          (xy -2.054700 -4.698600)
          (xy -2.048400 -4.715800)
          (xy -2.039000 -4.736500)
          (xy -2.022200 -4.766600)
          (xy -1.984100 -4.813900)
          (xy -1.936000 -4.853000)
          (xy -1.879100 -4.883100)
          (xy -1.814800 -4.903100)
          (xy -1.793200 -4.907000)
          (xy -1.746100 -4.911700)
          (xy -1.695200 -4.912600)
          (xy -1.644100 -4.910100)
        )
        (stroke (width 0.01)) (fill (type outline))
      )
      (polyline
        (pts
          (xy 0.639200 -4.909400)
          (xy 0.687700 -4.905500)
          (xy 0.730600 -4.900000)
          (xy 0.763800 -4.892900)
          (xy 0.768300 -4.891700)
          (xy 0.839800 -4.865100)
          (xy 0.901600 -4.830700)
          (xy 0.952900 -4.789100)
          (xy 0.993200 -4.740900)
          (xy 1.021800 -4.686700)
          (xy 1.038100 -4.627200)
          (xy 1.040400 -4.606600)
          (xy 1.040500 -4.560600)
          (xy 1.035100 -4.513800)
          (xy 1.024800 -4.473100)
          (xy 1.014900 -4.450200)
          (xy 0.992000 -4.412600)
          (xy 0.963600 -4.376700)
          (xy 0.933400 -4.347900)
          (xy 0.914600 -4.333700)
          (xy 0.887400 -4.315900)
          (xy 0.858400 -4.300500)
          (xy 0.825500 -4.286800)
          (xy 0.786700 -4.274200)
          (xy 0.740100 -4.261900)
          (xy 0.683800 -4.249300)
          (xy 0.615700 -4.235700)
          (xy 0.575700 -4.227700)
          (xy 0.536000 -4.219300)
          (xy 0.501800 -4.211500)
          (xy 0.475600 -4.204900)
          (xy 0.460300 -4.200200)
          (xy 0.434800 -4.186100)
          (xy 0.412600 -4.163400)
          (xy 0.400900 -4.136600)
          (xy 0.400700 -4.108200)
          (xy 0.413000 -4.080600)
          (xy 0.422900 -4.070300)
          (xy 0.442900 -4.055200)
          (xy 0.466400 -4.041700)
          (xy 0.483800 -4.033600)
          (xy 0.501100 -4.027600)
          (xy 0.519800 -4.024200)
          (xy 0.544100 -4.022700)
          (xy 0.578000 -4.022400)
          (xy 0.591700 -4.022500)
          (xy 0.623500 -4.023500)
          (xy 0.646900 -4.026000)
          (xy 0.665900 -4.030700)
          (xy 0.684700 -4.038300)
          (xy 0.710100 -4.051400)
          (xy 0.737600 -4.072600)
          (xy 0.756700 -4.099600)
          (xy 0.770700 -4.136000)
          (xy 0.778300 -4.158200)
          (xy 0.793100 -4.186500)
          (xy 0.813100 -4.206500)
          (xy 0.841100 -4.221600)
          (xy 0.862700 -4.228700)
          (xy 0.900100 -4.231400)
          (xy 0.935300 -4.220500)
          (xy 0.968600 -4.196000)
          (xy 0.973200 -4.191200)
          (xy 0.988300 -4.170400)
          (xy 0.997800 -4.149900)
          (xy 0.998900 -4.145300)
          (xy 1.001600 -4.123300)
          (xy 1.003500 -4.092200)
          (xy 1.004600 -4.054800)
          (xy 1.004900 -4.013900)
          (xy 1.004400 -3.972500)
          (xy 1.003200 -3.933300)
          (xy 1.001200 -3.899400)
          (xy 0.998600 -3.873400)
          (xy 0.995300 -3.858300)
          (xy 0.994000 -3.855300)
          (xy 0.974100 -3.825900)
          (xy 0.946500 -3.804600)
          (xy 0.914300 -3.792200)
          (xy 0.880400 -3.789400)
          (xy 0.847800 -3.796900)
          (xy 0.819300 -3.815400)
          (xy 0.801300 -3.832700)
          (xy 0.752900 -3.815900)
          (xy 0.741500 -3.812100)
          (xy 0.670000 -3.795600)
          (xy 0.594200 -3.789000)
          (xy 0.517300 -3.792200)
          (xy 0.442200 -3.804900)
          (xy 0.371800 -3.826700)
          (xy 0.309200 -3.857400)
          (xy 0.288900 -3.871000)
          (xy 0.244500 -3.909500)
          (xy 0.205800 -3.955100)
          (xy 0.176800 -4.003300)
          (xy 0.174000 -4.009300)
          (xy 0.165100 -4.029600)
          (xy 0.159500 -4.047400)
          (xy 0.156400 -4.066500)
          (xy 0.155100 -4.091200)
          (xy 0.154800 -4.125500)
          (xy 0.154800 -4.135500)
          (xy 0.155300 -4.167000)
          (xy 0.157000 -4.189800)
          (xy 0.160700 -4.208200)
          (xy 0.167100 -4.226200)
          (xy 0.177000 -4.248000)
          (xy 0.194300 -4.278800)
          (xy 0.229800 -4.324200)
          (xy 0.273100 -4.364400)
          (xy 0.320400 -4.395500)
          (xy 0.344200 -4.406800)
          (xy 0.387700 -4.423000)
          (xy 0.441600 -4.438800)
          (xy 0.506900 -4.454300)
          (xy 0.584900 -4.469900)
          (xy 0.594600 -4.471800)
          (xy 0.653900 -4.484100)
          (xy 0.700900 -4.496200)
          (xy 0.736600 -4.508900)
          (xy 0.762300 -4.522600)
          (xy 0.779200 -4.538000)
          (xy 0.788500 -4.555800)
          (xy 0.791400 -4.576500)
          (xy 0.789400 -4.594100)
          (xy 0.781500 -4.609100)
          (xy 0.764800 -4.626200)
          (xy 0.747400 -4.640200)
          (xy 0.717600 -4.657000)
          (xy 0.682300 -4.668100)
          (xy 0.639000 -4.674200)
          (xy 0.584900 -4.676100)
          (xy 0.539900 -4.674500)
          (xy 0.479400 -4.666200)
          (xy 0.429000 -4.651000)
          (xy 0.389300 -4.629200)
          (xy 0.360800 -4.601100)
          (xy 0.344300 -4.566800)
          (xy 0.329200 -4.533700)
          (xy 0.306000 -4.509100)
          (xy 0.277200 -4.493400)
          (xy 0.245000 -4.486500)
          (xy 0.211900 -4.488300)
          (xy 0.180200 -4.498600)
          (xy 0.152100 -4.517400)
          (xy 0.130100 -4.544400)
          (xy 0.116400 -4.579700)
          (xy 0.114100 -4.593400)
          (xy 0.111700 -4.624200)
          (xy 0.110600 -4.663400)
          (xy 0.111100 -4.707600)
          (xy 0.112600 -4.742300)
          (xy 0.116300 -4.782900)
          (xy 0.122700 -4.813700)
          (xy 0.132400 -4.837100)
          (xy 0.146300 -4.855200)
          (xy 0.165000 -4.870500)
          (xy 0.192000 -4.882300)
          (xy 0.226100 -4.886700)
          (xy 0.260500 -4.882700)
          (xy 0.289600 -4.870200)
          (xy 0.313000 -4.854500)
          (xy 0.378400 -4.876900)
          (xy 0.393000 -4.881800)
          (xy 0.426700 -4.892100)
          (xy 0.458000 -4.900700)
          (xy 0.481700 -4.906100)
          (xy 0.501000 -4.908700)
          (xy 0.541800 -4.911100)
          (xy 0.589200 -4.911300)
          (xy 0.639200 -4.909400)
        )
        (stroke (width 0.01)) (fill (type outline))
      )
      (polyline
        (pts
          (xy 3.985800 -4.911400)
          (xy 4.035200 -4.908500)
          (xy 4.075500 -4.903500)
          (xy 4.114700 -4.895300)
          (xy 4.206400 -4.867100)
          (xy 4.301000 -4.825700)
          (xy 4.366300 -4.793100)
          (xy 4.368500 -4.679500)
          (xy 4.370600 -4.566000)
          (xy 4.392000 -4.552200)
          (xy 4.412300 -4.536400)
          (xy 4.433700 -4.507000)
          (xy 4.443700 -4.470500)
          (xy 4.443200 -4.436700)
          (xy 4.431400 -4.405200)
          (xy 4.406900 -4.377000)
          (xy 4.400600 -4.371700)
          (xy 4.389000 -4.363300)
          (xy 4.375900 -4.356600)
          (xy 4.359900 -4.351500)
          (xy 4.339500 -4.347800)
          (xy 4.313000 -4.345200)
          (xy 4.279000 -4.343800)
          (xy 4.235800 -4.343100)
          (xy 4.182000 -4.343100)
          (xy 4.116000 -4.343700)
          (xy 3.904200 -4.345700)
          (xy 3.876600 -4.364100)
          (xy 3.851000 -4.387000)
          (xy 3.832500 -4.420000)
          (xy 3.826100 -4.459000)
          (xy 3.832300 -4.494700)
          (xy 3.850000 -4.527200)
          (xy 3.877400 -4.552800)
          (xy 3.912200 -4.568700)
          (xy 3.914200 -4.569200)
          (xy 3.933300 -4.571900)
          (xy 3.962100 -4.574200)
          (xy 3.996900 -4.575700)
          (xy 4.034300 -4.576200)
          (xy 4.128900 -4.576300)
          (xy 4.128900 -4.613000)
          (xy 4.128500 -4.634000)
          (xy 4.125700 -4.646000)
          (xy 4.118000 -4.652400)
          (xy 4.103100 -4.657400)
          (xy 4.051600 -4.669000)
          (xy 3.993000 -4.676300)
          (xy 3.931700 -4.679000)
          (xy 3.871700 -4.677000)
          (xy 3.816900 -4.670500)
          (xy 3.771100 -4.659200)
          (xy 3.743500 -4.648800)
          (xy 3.693400 -4.622100)
          (xy 3.655200 -4.589200)
          (xy 3.628400 -4.549700)
          (xy 3.612600 -4.503000)
          (xy 3.612500 -4.502400)
          (xy 3.609500 -4.478600)
          (xy 3.607600 -4.443600)
          (xy 3.606900 -4.400100)
          (xy 3.607400 -4.350500)
          (xy 3.608400 -4.311300)
          (xy 3.609900 -4.276500)
          (xy 3.612100 -4.250400)
          (xy 3.615200 -4.230100)
          (xy 3.619600 -4.212900)
          (xy 3.625700 -4.196100)
          (xy 3.628500 -4.189200)
          (xy 3.657600 -4.136800)
          (xy 3.696300 -4.092700)
          (xy 3.742700 -4.058400)
          (xy 3.795200 -4.035500)
          (xy 3.810200 -4.031500)
          (xy 3.863300 -4.022800)
          (xy 3.921000 -4.020400)
          (xy 3.979000 -4.024300)
          (xy 4.032900 -4.034000)
          (xy 4.078500 -4.049500)
          (xy 4.087200 -4.053800)
          (xy 4.112400 -4.071300)
          (xy 4.128600 -4.094500)
          (xy 4.139000 -4.127400)
          (xy 4.139500 -4.129400)
          (xy 4.151800 -4.156900)
          (xy 4.172800 -4.182700)
          (xy 4.198200 -4.201500)
          (xy 4.209400 -4.206200)
          (xy 4.242900 -4.211600)
          (xy 4.278900 -4.207500)
          (xy 4.312400 -4.194100)
          (xy 4.316900 -4.191400)
          (xy 4.333600 -4.180000)
          (xy 4.346200 -4.167500)
          (xy 4.355100 -4.151800)
          (xy 4.361200 -4.130800)
          (xy 4.365000 -4.102400)
          (xy 4.367300 -4.064400)
          (xy 4.368600 -4.014800)
          (xy 4.369200 -3.966100)
          (xy 4.368600 -3.923900)
          (xy 4.366200 -3.891600)
          (xy 4.361700 -3.867100)
          (xy 4.354800 -3.848400)
          (xy 4.345000 -3.833400)
          (xy 4.331900 -3.820200)
          (xy 4.317300 -3.809000)
          (xy 4.283100 -3.792900)
          (xy 4.247800 -3.788500)
          (xy 4.214100 -3.795900)
          (xy 4.184600 -3.815100)
          (xy 4.166800 -3.832100)
          (xy 4.110700 -3.815800)
          (xy 4.099500 -3.812800)
          (xy 4.062900 -3.804500)
          (xy 4.022200 -3.797000)
          (xy 3.984100 -3.791700)
          (xy 3.936700 -3.788200)
          (xy 3.848400 -3.790800)
          (xy 3.764600 -3.805300)
          (xy 3.686000 -3.831000)
          (xy 3.613700 -3.867300)
          (xy 3.548600 -3.913600)
          (xy 3.491600 -3.969400)
          (xy 3.443700 -4.033900)
          (xy 3.405800 -4.106600)
          (xy 3.378800 -4.186900)
          (xy 3.375600 -4.200400)
          (xy 3.371200 -4.223700)
          (xy 3.368200 -4.249200)
          (xy 3.366300 -4.279800)
          (xy 3.365300 -4.318400)
          (xy 3.365100 -4.367900)
          (xy 3.365200 -4.393600)
          (xy 3.366500 -4.450400)
          (xy 3.369700 -4.497400)
          (xy 3.375200 -4.537500)
          (xy 3.383600 -4.573500)
          (xy 3.395300 -4.608300)
          (xy 3.410700 -4.644600)
          (xy 3.418100 -4.660000)
          (xy 3.456300 -4.722100)
          (xy 3.503900 -4.775200)
          (xy 3.561300 -4.819600)
          (xy 3.629000 -4.855500)
          (xy 3.707400 -4.883200)
          (xy 3.796700 -4.903100)
          (xy 3.828800 -4.907300)
          (xy 3.878000 -4.910800)
          (xy 3.931900 -4.912200)
          (xy 3.985800 -4.911400)
        )
        (stroke (width 0.01)) (fill (type outline))
      )
      (polyline
        (pts
          (xy -3.462500 -4.891700)
          (xy -3.422600 -4.891000)
          (xy -3.372500 -4.889600)
          (xy -3.333400 -4.887500)
          (xy -3.303400 -4.884100)
          (xy -3.280800 -4.879200)
          (xy -3.264000 -4.872200)
          (xy -3.251200 -4.862700)
          (xy -3.240700 -4.850300)
          (xy -3.230700 -4.834600)
          (xy -3.228300 -4.830300)
          (xy -3.214700 -4.792900)
          (xy -3.213800 -4.756400)
          (xy -3.224500 -4.723000)
          (xy -3.245900 -4.694500)
          (xy -3.276900 -4.673000)
          (xy -3.316700 -4.660300)
          (xy -3.345400 -4.655400)
          (xy -3.523700 -4.243400)
          (xy -3.534900 -4.217600)
          (xy -3.565300 -4.147500)
          (xy -3.594100 -4.081500)
          (xy -3.620800 -4.020500)
          (xy -3.644900 -3.965700)
          (xy -3.665900 -3.918100)
          (xy -3.683400 -3.878900)
          (xy -3.696900 -3.849100)
          (xy -3.705900 -3.829700)
          (xy -3.709900 -3.821900)
          (xy -3.713800 -3.819500)
          (xy -3.722700 -3.817300)
          (xy -3.737700 -3.815600)
          (xy -3.760100 -3.814400)
          (xy -3.791200 -3.813500)
          (xy -3.832200 -3.812900)
          (xy -3.884500 -3.812600)
          (xy -3.950900 -3.812600)
          (xy -4.013900 -3.812700)
          (xy -4.064700 -3.812900)
          (xy -4.104900 -3.813400)
          (xy -4.135900 -3.814200)
          (xy -4.159400 -3.815400)
          (xy -4.176900 -3.817000)
          (xy -4.189900 -3.819200)
          (xy -4.200000 -3.822000)
          (xy -4.208700 -3.825500)
          (xy -4.236900 -3.843500)
          (xy -4.260000 -3.870800)
          (xy -4.273700 -3.902800)
          (xy -4.277100 -3.936800)
          (xy -4.269600 -3.970000)
          (xy -4.250600 -3.999700)
          (xy -4.232600 -4.017400)
          (xy -4.214400 -4.029700)
          (xy -4.193000 -4.037700)
          (xy -4.164800 -4.042600)
          (xy -4.126400 -4.045700)
          (xy -4.055600 -4.049800)
          (xy -4.184500 -4.352300)
          (xy -4.197800 -4.383600)
          (xy -3.936000 -4.383600)
          (xy -3.929700 -4.368100)
          (xy -3.927400 -4.362500)
          (xy -3.919800 -4.344600)
          (xy -3.908500 -4.318200)
          (xy -3.894500 -4.285700)
          (xy -3.878900 -4.249800)
          (xy -3.834300 -4.147100)
          (xy -3.824400 -4.170700)
          (xy -3.823100 -4.173600)
          (xy -3.815600 -4.191500)
          (xy -3.804200 -4.218100)
          (xy -3.790500 -4.250300)
          (xy -3.775600 -4.285100)
          (xy -3.770100 -4.298000)
          (xy -3.756900 -4.329200)
          (xy -3.746400 -4.354700)
          (xy -3.739300 -4.372400)
          (xy -3.736700 -4.379700)
          (xy -3.737900 -4.380300)
          (xy -3.749500 -4.381600)
          (xy -3.771300 -4.382700)
          (xy -3.801100 -4.383300)
          (xy -3.836400 -4.383600)
          (xy -3.936000 -4.383600)
          (xy -4.197800 -4.383600)
          (xy -4.313500 -4.654900)
          (xy -4.349200 -4.662900)
          (xy -4.354500 -4.664200)
          (xy -4.393800 -4.679800)
          (xy -4.422300 -4.703600)
          (xy -4.439700 -4.735300)
          (xy -4.445500 -4.774400)
          (xy -4.445400 -4.781200)
          (xy -4.437500 -4.818900)
          (xy -4.418200 -4.849400)
          (xy -4.388100 -4.871900)
          (xy -4.347600 -4.885900)
          (xy -4.340300 -4.886900)
          (xy -4.318300 -4.888400)
          (xy -4.286200 -4.889500)
          (xy -4.246400 -4.890300)
          (xy -4.201200 -4.890700)
          (xy -4.153100 -4.890600)
          (xy -4.149800 -4.890500)
          (xy -4.097000 -4.890000)
          (xy -4.056100 -4.889200)
          (xy -4.025200 -4.888000)
          (xy -4.002600 -4.886400)
          (xy -3.986400 -4.884200)
          (xy -3.974900 -4.881200)
          (xy -3.966200 -4.877400)
          (xy -3.947100 -4.864600)
          (xy -3.922500 -4.837000)
          (xy -3.907900 -4.804200)
          (xy -3.904100 -4.769200)
          (xy -3.911500 -4.734600)
          (xy -3.930700 -4.703200)
          (xy -3.942100 -4.690900)
          (xy -3.962400 -4.674400)
          (xy -3.985000 -4.664900)
          (xy -4.015800 -4.659500)
          (xy -4.051000 -4.655400)
          (xy -4.041800 -4.633100)
          (xy -4.032600 -4.610700)
          (xy -3.635700 -4.610700)
          (xy -3.627700 -4.628200)
          (xy -3.623700 -4.637700)
          (xy -3.620800 -4.651400)
          (xy -3.627800 -4.657500)
          (xy -3.646200 -4.658900)
          (xy -3.647000 -4.658900)
          (xy -3.684000 -4.664900)
          (xy -3.714900 -4.681100)
          (xy -3.738900 -4.705000)
          (xy -3.755200 -4.734400)
          (xy -3.762700 -4.766900)
          (xy -3.760600 -4.800200)
          (xy -3.748000 -4.832000)
          (xy -3.724000 -4.860000)
          (xy -3.714200 -4.867300)
          (xy -3.698200 -4.875900)
          (xy -3.678300 -4.882400)
          (xy -3.652800 -4.887100)
          (xy -3.620100 -4.890200)
          (xy -3.578600 -4.891800)
          (xy -3.526600 -4.892300)
          (xy -3.462500 -4.891700)
        )
        (stroke (width 0.01)) (fill (type outline))
      )
      (polyline
        (pts
          (xy -0.319800 -4.892100)
          (xy -0.250300 -4.891900)
          (xy -0.192300 -4.891500)
          (xy -0.145000 -4.890900)
          (xy -0.107700 -4.890100)
          (xy -0.079500 -4.889000)
          (xy -0.059800 -4.887800)
          (xy -0.047800 -4.886300)
          (xy -0.042700 -4.884600)
          (xy -0.040200 -4.875600)
          (xy -0.038100 -4.855200)
          (xy -0.036500 -4.825700)
          (xy -0.035300 -4.789400)
          (xy -0.034600 -4.748800)
          (xy -0.034400 -4.706200)
          (xy -0.034700 -4.664000)
          (xy -0.035500 -4.624500)
          (xy -0.036800 -4.590000)
          (xy -0.038600 -4.563000)
          (xy -0.041000 -4.545800)
          (xy -0.046500 -4.528000)
          (xy -0.065800 -4.495000)
          (xy -0.097000 -4.467300)
          (xy -0.101500 -4.464500)
          (xy -0.131400 -4.454100)
          (xy -0.165900 -4.452700)
          (xy -0.200500 -4.460100)
          (xy -0.230500 -4.476000)
          (xy -0.238900 -4.482800)
          (xy -0.256500 -4.502600)
          (xy -0.267600 -4.526700)
          (xy -0.273600 -4.558200)
          (xy -0.275300 -4.600100)
          (xy -0.275300 -4.658900)
          (xy -0.688200 -4.658900)
          (xy -0.688200 -4.466200)
          (xy -0.593400 -4.466200)
          (xy -0.588700 -4.497600)
          (xy -0.579100 -4.526200)
          (xy -0.559600 -4.554000)
          (xy -0.534000 -4.575500)
          (xy -0.505800 -4.587100)
          (xy -0.502200 -4.587700)
          (xy -0.459400 -4.589400)
          (xy -0.421100 -4.580200)
          (xy -0.389300 -4.561000)
          (xy -0.366400 -4.532700)
          (xy -0.365800 -4.531700)
          (xy -0.362100 -4.522900)
          (xy -0.359300 -4.511400)
          (xy -0.357200 -4.495400)
          (xy -0.355800 -4.473100)
          (xy -0.355000 -4.442500)
          (xy -0.354500 -4.401800)
          (xy -0.354400 -4.349200)
          (xy -0.354400 -4.339400)
          (xy -0.354500 -4.290200)
          (xy -0.354800 -4.252500)
          (xy -0.355500 -4.224500)
          (xy -0.356700 -4.204200)
          (xy -0.358700 -4.189600)
          (xy -0.361600 -4.178900)
          (xy -0.365500 -4.170200)
          (xy -0.370600 -4.161500)
          (xy -0.373400 -4.157200)
          (xy -0.399800 -4.130600)
          (xy -0.434700 -4.114000)
          (xy -0.476400 -4.108300)
          (xy -0.484800 -4.108600)
          (xy -0.522800 -4.116800)
          (xy -0.553200 -4.136300)
          (xy -0.575400 -4.166500)
          (xy -0.588600 -4.206600)
          (xy -0.593400 -4.232200)
          (xy -0.688200 -4.232200)
          (xy -0.688200 -4.046400)
          (xy -0.316600 -4.046400)
          (xy -0.316600 -4.101700)
          (xy -0.314600 -4.143400)
          (xy -0.307800 -4.175200)
          (xy -0.295300 -4.199800)
          (xy -0.275900 -4.220300)
          (xy -0.260000 -4.231600)
          (xy -0.225700 -4.245300)
          (xy -0.189700 -4.248100)
          (xy -0.154900 -4.240900)
          (xy -0.123700 -4.224500)
          (xy -0.099000 -4.199500)
          (xy -0.083400 -4.166700)
          (xy -0.083000 -4.165000)
          (xy -0.080400 -4.147000)
          (xy -0.078400 -4.119300)
          (xy -0.076900 -4.084300)
          (xy -0.076000 -4.044200)
          (xy -0.075500 -4.001500)
          (xy -0.075700 -3.958500)
          (xy -0.076300 -3.917500)
          (xy -0.077400 -3.880900)
          (xy -0.079100 -3.851000)
          (xy -0.081300 -3.830100)
          (xy -0.084000 -3.820700)
          (xy -0.085100 -3.820200)
          (xy -0.097400 -3.818600)
          (xy -0.121600 -3.817200)
          (xy -0.156300 -3.816000)
          (xy -0.200200 -3.815000)
          (xy -0.251700 -3.814000)
          (xy -0.309600 -3.813300)
          (xy -0.372400 -3.812700)
          (xy -0.438700 -3.812300)
          (xy -0.507100 -3.812100)
          (xy -0.576300 -3.812000)
          (xy -0.644700 -3.812100)
          (xy -0.711000 -3.812400)
          (xy -0.773900 -3.812900)
          (xy -0.831800 -3.813500)
          (xy -0.883500 -3.814300)
          (xy -0.927400 -3.815400)
          (xy -0.962200 -3.816500)
          (xy -0.986500 -3.817900)
          (xy -0.998900 -3.819500)
          (xy -1.023200 -3.831500)
          (xy -1.047500 -3.853000)
          (xy -1.067000 -3.879200)
          (xy -1.077500 -3.905600)
          (xy -1.078000 -3.908200)
          (xy -1.077300 -3.943400)
          (xy -1.066000 -3.978000)
          (xy -1.045900 -4.007900)
          (xy -1.019000 -4.029000)
          (xy -1.011500 -4.032200)
          (xy -0.989300 -4.038700)
          (xy -0.964500 -4.043500)
          (xy -0.929100 -4.048200)
          (xy -0.929100 -4.658900)
          (xy -0.951400 -4.658900)
          (xy -0.978800 -4.661500)
          (xy -1.015900 -4.674400)
          (xy -1.046000 -4.696500)
          (xy -1.067400 -4.725900)
          (xy -1.078500 -4.760700)
          (xy -1.077600 -4.799200)
          (xy -1.069700 -4.822900)
          (xy -1.048600 -4.851400)
          (xy -1.017200 -4.873000)
          (xy -0.977200 -4.886400)
          (xy -0.974900 -4.886700)
          (xy -0.959400 -4.887500)
          (xy -0.931800 -4.888400)
          (xy -0.893400 -4.889100)
          (xy -0.845200 -4.889800)
          (xy -0.788600 -4.890500)
          (xy -0.724800 -4.891000)
          (xy -0.654900 -4.891500)
          (xy -0.580300 -4.891800)
          (xy -0.502000 -4.892000)
          (xy -0.496100 -4.892100)
          (xy -0.401500 -4.892200)
          (xy -0.319800 -4.892100)
        )
        (stroke (width 0.01)) (fill (type outline))
      )
      (polyline
        (pts
          (xy 3.175200 -4.892800)
          (xy 3.207600 -4.892400)
          (xy 3.243800 -4.890900)
          (xy 3.274900 -4.888600)
          (xy 3.296800 -4.885900)
          (xy 3.303600 -4.884400)
          (xy 3.340300 -4.869400)
          (xy 3.368300 -4.845100)
          (xy 3.386300 -4.813200)
          (xy 3.392600 -4.775500)
          (xy 3.390600 -4.751800)
          (xy 3.378000 -4.716100)
          (xy 3.354600 -4.688000)
          (xy 3.321400 -4.668800)
          (xy 3.279500 -4.659400)
          (xy 3.236400 -4.655400)
          (xy 3.184300 -4.586600)
          (xy 3.165700 -4.562500)
          (xy 3.137800 -4.527900)
          (xy 3.110300 -4.495000)
          (xy 3.087000 -4.468600)
          (xy 3.041800 -4.419400)
          (xy 3.076100 -4.397300)
          (xy 3.082900 -4.392800)
          (xy 3.124900 -4.357600)
          (xy 3.162400 -4.314300)
          (xy 3.191000 -4.267900)
          (xy 3.193400 -4.263000)
          (xy 3.201100 -4.245600)
          (xy 3.206000 -4.229200)
          (xy 3.208700 -4.210200)
          (xy 3.210000 -4.184900)
          (xy 3.210200 -4.149600)
          (xy 3.210200 -4.131900)
          (xy 3.209600 -4.102000)
          (xy 3.207800 -4.080100)
          (xy 3.204000 -4.062300)
          (xy 3.197600 -4.044600)
          (xy 3.187800 -4.023200)
          (xy 3.168600 -3.988700)
          (xy 3.128000 -3.938400)
          (xy 3.076000 -3.895500)
          (xy 3.012700 -3.860000)
          (xy 2.938400 -3.832300)
          (xy 2.933400 -3.830800)
          (xy 2.920100 -3.827200)
          (xy 2.906600 -3.824300)
          (xy 2.891300 -3.821900)
          (xy 2.872700 -3.820000)
          (xy 2.849400 -3.818500)
          (xy 2.819800 -3.817300)
          (xy 2.782500 -3.816400)
          (xy 2.735800 -3.815600)
          (xy 2.678500 -3.814900)
          (xy 2.608800 -3.814100)
          (xy 2.565400 -3.813700)
          (xy 2.502600 -3.813200)
          (xy 2.451300 -3.813000)
          (xy 2.410300 -3.813100)
          (xy 2.378000 -3.813600)
          (xy 2.353300 -3.814400)
          (xy 2.334500 -3.815700)
          (xy 2.320500 -3.817500)
          (xy 2.309800 -3.819800)
          (xy 2.301100 -3.822700)
          (xy 2.284400 -3.830500)
          (xy 2.255100 -3.853900)
          (xy 2.235100 -3.884100)
          (xy 2.225900 -3.918600)
          (xy 2.229000 -3.954600)
          (xy 2.242100 -3.987700)
          (xy 2.264500 -4.015100)
          (xy 2.296300 -4.033300)
          (xy 2.338600 -4.043500)
          (xy 2.374100 -4.048200)
          (xy 2.374100 -4.273500)
          (xy 2.615000 -4.273500)
          (xy 2.615000 -4.045300)
          (xy 2.740800 -4.047600)
          (xy 2.783800 -4.048400)
          (xy 2.817900 -4.049500)
          (xy 2.843000 -4.051000)
          (xy 2.861400 -4.053200)
          (xy 2.875600 -4.056500)
          (xy 2.887900 -4.061200)
          (xy 2.900800 -4.067500)
          (xy 2.914200 -4.075000)
          (xy 2.943700 -4.098500)
          (xy 2.960200 -4.124400)
          (xy 2.963300 -4.151900)
          (xy 2.953000 -4.180200)
          (xy 2.929200 -4.208500)
          (xy 2.926800 -4.210700)
          (xy 2.897100 -4.232100)
          (xy 2.861700 -4.248000)
          (xy 2.817800 -4.259300)
          (xy 2.762900 -4.266900)
          (xy 2.755900 -4.267600)
          (xy 2.720600 -4.270400)
          (xy 2.685800 -4.272500)
          (xy 2.658000 -4.273300)
          (xy 2.615000 -4.273500)
          (xy 2.374100 -4.273500)
          (xy 2.374100 -4.657200)
          (xy 2.336800 -4.660300)
          (xy 2.327700 -4.661300)
          (xy 2.289200 -4.673500)
          (xy 2.258200 -4.696800)
          (xy 2.235900 -4.730300)
          (xy 2.231600 -4.740300)
          (xy 2.224100 -4.768400)
          (xy 2.226200 -4.794400)
          (xy 2.238200 -4.824100)
          (xy 2.258800 -4.853100)
          (xy 2.287800 -4.873200)
          (xy 2.327000 -4.885700)
          (xy 2.337200 -4.887000)
          (xy 2.361200 -4.888400)
          (xy 2.395000 -4.889600)
          (xy 2.436300 -4.890300)
          (xy 2.482800 -4.890600)
          (xy 2.532400 -4.890500)
          (xy 2.575200 -4.890000)
          (xy 2.626200 -4.889100)
          (xy 2.666300 -4.887500)
          (xy 2.697100 -4.885000)
          (xy 2.720400 -4.881300)
          (xy 2.737900 -4.876000)
          (xy 2.751200 -4.868900)
          (xy 2.762100 -4.859700)
          (xy 2.772100 -4.848000)
          (xy 2.776200 -4.842600)
          (xy 2.793900 -4.807300)
          (xy 2.799000 -4.770600)
          (xy 2.791400 -4.734900)
          (xy 2.771300 -4.702400)
          (xy 2.757600 -4.688500)
          (xy 2.731700 -4.671100)
          (xy 2.700300 -4.661700)
          (xy 2.659900 -4.658900)
          (xy 2.615000 -4.658900)
          (xy 2.615000 -4.500600)
          (xy 2.709000 -4.500600)
          (xy 2.735100 -4.501200)
          (xy 2.753000 -4.503000)
          (xy 2.766400 -4.507000)
          (xy 2.778800 -4.513900)
          (xy 2.793800 -4.524600)
          (xy 2.824400 -4.549900)
          (xy 2.864400 -4.589000)
          (xy 2.907100 -4.636400)
          (xy 2.950800 -4.689900)
          (xy 2.993600 -4.747500)
          (xy 3.033700 -4.807000)
          (xy 3.046100 -4.826600)
          (xy 3.063300 -4.853800)
          (xy 3.076600 -4.872400)
          (xy 3.088500 -4.884100)
          (xy 3.101600 -4.890300)
          (xy 3.118700 -4.892800)
          (xy 3.142300 -4.893100)
          (xy 3.175200 -4.892800)
        )
        (stroke (width 0.01)) (fill (type outline))
      )
      (polyline
        (pts
          (xy 1.832400 -4.491700)
          (xy 1.891800 -4.491400)
          (xy 1.945700 -4.490900)
          (xy 1.992400 -4.490300)
          (xy 2.030300 -4.489500)
          (xy 2.057700 -4.488600)
          (xy 2.073000 -4.487600)
          (xy 2.086800 -4.485400)
          (xy 2.120500 -4.474500)
          (xy 2.145900 -4.454900)
          (xy 2.166400 -4.424500)
          (xy 2.176500 -4.396700)
          (xy 2.178400 -4.360200)
          (xy 2.168800 -4.325500)
          (xy 2.148600 -4.295500)
          (xy 2.118800 -4.273100)
          (xy 2.117900 -4.272700)
          (xy 2.112000 -4.269900)
          (xy 2.105200 -4.267600)
          (xy 2.096600 -4.265600)
          (xy 2.085100 -4.264100)
          (xy 2.069500 -4.262800)
          (xy 2.048800 -4.261900)
          (xy 2.021900 -4.261200)
          (xy 1.987800 -4.260800)
          (xy 1.945200 -4.260500)
          (xy 1.893300 -4.260500)
          (xy 1.830800 -4.260700)
          (xy 1.756700 -4.260900)
          (xy 1.669900 -4.261300)
          (xy 1.247900 -4.263200)
          (xy 1.223200 -4.282000)
          (xy 1.200800 -4.305100)
          (xy 1.184300 -4.337800)
          (xy 1.178500 -4.373800)
          (xy 1.183700 -4.409700)
          (xy 1.200500 -4.442300)
          (xy 1.207800 -4.451300)
          (xy 1.227700 -4.469800)
          (xy 1.251200 -4.480900)
          (xy 1.283400 -4.487300)
          (xy 1.294100 -4.488100)
          (xy 1.318800 -4.489100)
          (xy 1.354300 -4.489900)
          (xy 1.399000 -4.490600)
          (xy 1.451400 -4.491100)
          (xy 1.509600 -4.491500)
          (xy 1.572100 -4.491800)
          (xy 1.637300 -4.492000)
          (xy 1.769100 -4.492000)
          (xy 1.832400 -4.491700)
        )
        (stroke (width 0.01)) (fill (type outline))
      )
      (polyline
        (pts
          (xy 1.115600 -3.435400)
          (xy 1.137800 -3.421600)
          (xy 1.168300 -3.391200)
          (xy 1.187100 -3.354100)
          (xy 1.193700 -3.311000)
          (xy 1.193700 -3.308100)
          (xy 1.193200 -3.300900)
          (xy 1.191800 -3.292500)
          (xy 1.189300 -3.282100)
          (xy 1.185200 -3.268900)
          (xy 1.179400 -3.252200)
          (xy 1.171400 -3.231100)
          (xy 1.161100 -3.205100)
          (xy 1.147900 -3.173200)
          (xy 1.131700 -3.134800)
          (xy 1.112200 -3.089100)
          (xy 1.088900 -3.035400)
          (xy 1.061600 -2.972800)
          (xy 1.030100 -2.900700)
          (xy 0.993900 -2.818200)
          (xy 0.952700 -2.724700)
          (xy 0.906300 -2.619300)
          (xy 0.873600 -2.544900)
          (xy 0.835500 -2.458300)
          (xy 0.799400 -2.375900)
          (xy 0.765500 -2.298600)
          (xy 0.734400 -2.227300)
          (xy 0.706200 -2.162700)
          (xy 0.681500 -2.105700)
          (xy 0.660400 -2.057200)
          (xy 0.643600 -2.017900)
          (xy 0.631100 -1.988700)
          (xy 0.623500 -1.970500)
          (xy 0.621200 -1.964000)
          (xy 0.621600 -1.963900)
          (xy 0.630700 -1.966700)
          (xy 0.649400 -1.974100)
          (xy 0.675300 -1.985000)
          (xy 0.706000 -1.998500)
          (xy 0.800600 -2.038000)
          (xy 0.960500 -2.093400)
          (xy 1.123000 -2.135700)
          (xy 1.287400 -2.165200)
          (xy 1.452900 -2.181700)
          (xy 1.618700 -2.185600)
          (xy 1.784000 -2.176700)
          (xy 1.948100 -2.155300)
          (xy 2.110100 -2.121300)
          (xy 2.269200 -2.075000)
          (xy 2.424800 -2.016300)
          (xy 2.576000 -1.945400)
          (xy 2.722000 -1.862200)
          (xy 2.862000 -1.767000)
          (xy 2.903000 -1.736100)
          (xy 2.962000 -1.688800)
          (xy 3.018600 -1.639700)
          (xy 3.076200 -1.585500)
          (xy 3.138400 -1.523300)
          (xy 3.250500 -1.400800)
          (xy 3.353600 -1.270800)
          (xy 3.443400 -1.137500)
          (xy 3.520200 -1.000600)
          (xy 3.583900 -0.859900)
          (xy 3.634800 -0.715200)
          (xy 3.673000 -0.566200)
          (xy 3.698600 -0.412600)
          (xy 3.700800 -0.392600)
          (xy 3.704600 -0.341400)
          (xy 3.707300 -0.281800)
          (xy 3.708700 -0.217600)
          (xy 3.708900 -0.152400)
          (xy 3.707900 -0.089900)
          (xy 3.705600 -0.033800)
          (xy 3.701900 0.012300)
          (xy 3.699300 0.035200)
          (xy 3.674700 0.195600)
          (xy 3.638600 0.358700)
          (xy 3.590800 0.524600)
          (xy 3.531200 0.693700)
          (xy 3.459800 0.866100)
          (xy 3.376300 1.042000)
          (xy 3.280700 1.221800)
          (xy 3.173000 1.405500)
          (xy 3.052800 1.593500)
          (xy 2.920300 1.785900)
          (xy 2.775100 1.982900)
          (xy 2.617300 2.184900)
          (xy 2.586700 2.222900)
          (xy 2.529900 2.292600)
          (xy 2.472800 2.361600)
          (xy 2.414800 2.430500)
          (xy 2.355200 2.499900)
          (xy 2.293600 2.570600)
          (xy 2.229300 2.643200)
          (xy 2.161700 2.718200)
          (xy 2.090200 2.796400)
          (xy 2.014200 2.878400)
          (xy 1.933100 2.964800)
          (xy 1.846400 3.056300)
          (xy 1.753400 3.153600)
          (xy 1.653500 3.257200)
          (xy 1.546100 3.367900)
          (xy 1.430700 3.486200)
          (xy 1.306600 3.612800)
          (xy 1.173300 3.748500)
          (xy 1.097600 3.825400)
          (xy 0.968000 3.957800)
          (xy 0.845500 4.083700)
          (xy 0.728500 4.204800)
          (xy 0.615100 4.323200)
          (xy 0.503500 4.440700)
          (xy 0.392000 4.559100)
          (xy 0.278700 4.680400)
          (xy 0.161800 4.806300)
          (xy 0.155400 4.813300)
          (xy 0.120800 4.849200)
          (xy 0.092400 4.875600)
          (xy 0.068100 4.894000)
          (xy 0.046000 4.905500)
          (xy 0.024100 4.911500)
          (xy 0.000400 4.913300)
          (xy -0.023200 4.911500)
          (xy -0.046200 4.904800)
          (xy -0.069800 4.892000)
          (xy -0.095900 4.871900)
          (xy -0.126400 4.843200)
          (xy -0.163200 4.804600)
          (xy -0.193400 4.771900)
          (xy -0.301100 4.655800)
          (xy -0.406200 4.543300)
          (xy -0.510400 4.432700)
          (xy -0.615200 4.322300)
          (xy -0.722100 4.210600)
          (xy -0.832800 4.095900)
          (xy -0.948700 3.976600)
          (xy -1.071500 3.851000)
          (xy -1.202700 3.717600)
          (xy -1.238200 3.681500)
          (xy -1.356200 3.561600)
          (xy -1.465200 3.450400)
          (xy -1.565900 3.347200)
          (xy -1.659100 3.251300)
          (xy -1.745400 3.162000)
          (xy -1.825400 3.078600)
          (xy -1.899900 3.000400)
          (xy -1.969500 2.926600)
          (xy -2.035000 2.856500)
          (xy -2.096800 2.789400)
          (xy -2.155900 2.724500)
          (xy -2.212700 2.661300)
          (xy -2.268000 2.598900)
          (xy -2.322500 2.536600)
          (xy -2.376900 2.473700)
          (xy -2.431700 2.409600)
          (xy -2.447500 2.391000)
          (xy -2.619700 2.182300)
          (xy -2.779100 1.978200)
          (xy -2.925800 1.778700)
          (xy -3.059600 1.583500)
          (xy -3.180900 1.392600)
          (xy -3.289500 1.205900)
          (xy -3.385600 1.023200)
          (xy -3.469300 0.844300)
          (xy -3.540500 0.669300)
          (xy -3.599400 0.497900)
          (xy -3.646000 0.330100)
          (xy -3.680400 0.165700)
          (xy -3.702600 0.004600)
          (xy -3.703900 -0.008800)
          (xy -3.707100 -0.061600)
          (xy -3.708600 -0.122700)
          (xy -3.708700 -0.188700)
          (xy -3.707300 -0.256700)
          (xy -3.704600 -0.323500)
          (xy -3.700700 -0.385900)
          (xy -3.695500 -0.440800)
          (xy -3.689300 -0.485200)
          (xy -3.686600 -0.500300)
          (xy -3.653200 -0.650300)
          (xy -3.609500 -0.792400)
          (xy -3.554900 -0.928600)
          (xy -3.488400 -1.060900)
          (xy -3.409300 -1.191300)
          (xy -3.337700 -1.292300)
          (xy -3.252600 -1.397700)
          (xy -3.159300 -1.500800)
          (xy -3.059800 -1.599500)
          (xy -2.956500 -1.691600)
          (xy -2.851700 -1.774700)
          (xy -2.747700 -1.846700)
          (xy -2.706300 -1.872300)
          (xy -2.563300 -1.951400)
          (xy -2.413300 -2.020300)
          (xy -2.259100 -2.077800)
          (xy -2.103400 -2.122800)
          (xy -1.997400 -2.146200)
          (xy -1.827300 -2.172300)
          (xy -1.655900 -2.184800)
          (xy -1.484000 -2.183700)
          (xy -1.312200 -2.169000)
          (xy -1.141300 -2.140700)
          (xy -1.123400 -2.136900)
          (xy -1.044400 -2.117600)
          (xy -0.961400 -2.093800)
          (xy -0.877700 -2.066800)
          (xy -0.797100 -2.037600)
          (xy -0.723000 -2.007500)
          (xy -0.659100 -1.977700)
          (xy -0.644600 -1.970800)
          (xy -0.629000 -1.964700)
          (xy -0.621500 -1.963700)
          (xy -0.622800 -1.968000)
          (xy -0.629200 -1.984000)
          (xy -0.640500 -2.011100)
          (xy -0.656400 -2.048400)
          (xy -0.676400 -2.095200)
          (xy -0.700300 -2.150600)
          (xy -0.727600 -2.213700)
          (xy -0.758000 -2.283700)
          (xy -0.791200 -2.359800)
          (xy -0.826800 -2.441100)
          (xy -0.864400 -2.526900)
          (xy -0.903600 -2.616200)
          (xy -0.933500 -2.684200)
          (xy -0.971800 -2.771600)
          (xy -1.008300 -2.855100)
          (xy -1.042600 -2.933800)
          (xy -1.074400 -3.006800)
          (xy -1.103200 -3.073400)
          (xy -1.128800 -3.132500)
          (xy -1.150600 -3.183400)
          (xy -1.168400 -3.225200)
          (xy -1.181800 -3.257000)
          (xy -1.190300 -3.277900)
          (xy -1.193700 -3.287100)
          (xy -1.195500 -3.312900)
          (xy -1.187900 -3.349400)
          (xy -1.170400 -3.384400)
          (xy -1.144700 -3.414800)
          (xy -1.112700 -3.437100)
          (xy -1.077700 -3.454600)
          (xy 1.078800 -3.454600)
          (xy 1.115600 -3.435400)
        )
        (stroke (width 0.01)) (fill (type outline))
      )
    )
  )
)
