(footprint "PinHeader_1x07_P2.54mm_Vertical" (version 20211014) (generator pcbnew)
  (layer "F.Cu")
  (tedit 59FED5CC)
  (descr "Through hole straight pin header, 1x07, 2.54mm pitch, single row")
  (tags "Through hole pin header THT 1x07 2.54mm single row")
  (property "Sheetfile" "acesrg_motor_encoder_controller.kicad_sch")
  (property "Sheetname" "")
  (attr through_hole)
  (fp_text reference "J5" (at 0 -2.33) (layer "F.SilkS")
    (effects (font (size 1 1) (thickness 0.15)))
    (tstamp dd5fa596-4d2f-4178-955f-d32be7c6c5fe)
  )
  (fp_text value "spi" (at 0 17.57) (layer "F.Fab")
    (effects (font (size 1 1) (thickness 0.15)))
    (tstamp 85ab009b-a4fb-4bfa-8e9e-0b2c504624be)
  )
  (fp_text user "${REFERENCE}" (at 0 7.62 90) (layer "F.Fab")
    (effects (font (size 1 1) (thickness 0.15)))
    (tstamp 0eaf28c7-43a1-48c1-8c84-2c50326046a3)
  )
  (fp_line (start 1.33 1.27) (end 1.33 16.57) (layer "F.SilkS") (width 0.12) (tstamp 221ae3df-0817-4b66-bc9b-dcfcda2be1bc))
  (fp_line (start -1.33 1.27) (end -1.33 16.57) (layer "F.SilkS") (width 0.12) (tstamp 5588d0ec-7ee2-4104-a3a5-64b3f014ade4))
  (fp_line (start -1.33 -1.33) (end 0 -1.33) (layer "F.SilkS") (width 0.12) (tstamp 9c5f44b0-1cd6-4e62-922c-d5e5576b1017))
  (fp_line (start -1.33 16.57) (end 1.33 16.57) (layer "F.SilkS") (width 0.12) (tstamp c0547b89-532c-44c2-a4d3-430340414d37))
  (fp_line (start -1.33 1.27) (end 1.33 1.27) (layer "F.SilkS") (width 0.12) (tstamp c8fea0d8-4dd5-4191-b52d-2a75ab6dc5ef))
  (fp_line (start -1.33 0) (end -1.33 -1.33) (layer "F.SilkS") (width 0.12) (tstamp f810a18d-753b-43af-a5c8-804df87d9eb9))
  (fp_line (start 1.8 17.05) (end 1.8 -1.8) (layer "F.CrtYd") (width 0.05) (tstamp 197720f3-b31a-4497-8b27-34e5eb55973e))
  (fp_line (start -1.8 17.05) (end 1.8 17.05) (layer "F.CrtYd") (width 0.05) (tstamp 2ceab8db-6000-4146-a868-1880498607e7))
  (fp_line (start -1.8 -1.8) (end -1.8 17.05) (layer "F.CrtYd") (width 0.05) (tstamp 5774f8ce-27d4-4c5e-b4b8-c4eea343ba05))
  (fp_line (start 1.8 -1.8) (end -1.8 -1.8) (layer "F.CrtYd") (width 0.05) (tstamp e60c6320-92eb-44f4-a5d5-28ecd570f718))
  (fp_line (start 1.27 -1.27) (end 1.27 16.51) (layer "F.Fab") (width 0.1) (tstamp 181c53ca-e9a1-4dee-b6fb-e0ddab7d96a6))
  (fp_line (start -0.635 -1.27) (end 1.27 -1.27) (layer "F.Fab") (width 0.1) (tstamp 4ceb931f-d8c4-4f29-a815-ef03afb079d4))
  (fp_line (start -1.27 -0.635) (end -0.635 -1.27) (layer "F.Fab") (width 0.1) (tstamp 9b1a7567-9ad1-4b83-9ada-eac05887a121))
  (fp_line (start -1.27 16.51) (end -1.27 -0.635) (layer "F.Fab") (width 0.1) (tstamp bfa5cbbc-01bb-4ce2-8efb-3c64f2762304))
  (fp_line (start 1.27 16.51) (end -1.27 16.51) (layer "F.Fab") (width 0.1) (tstamp eaed48d4-fd98-47d0-a38b-f3e64e514f8b))
  (pad "1" thru_hole rect (at 0 0) (size 1.7 1.7) (drill 0.25) (layers *.Cu *.Mask) (tstamp fa754d23-bc65-4567-99ff-ed8cdb7f0381))
  (pad "2" thru_hole oval (at 0 2.54) (size 1.7 1.7) (drill 0.25) (layers *.Cu *.Mask) (tstamp ae072daa-cf0b-44e9-a01f-1870a99c5b38))
  (pad "3" thru_hole oval (at 0 5.08) (size 1.7 1.7) (drill 0.25) (layers *.Cu *.Mask) (tstamp be4beeb1-f6ab-4009-93d4-27e1a0a9ca66))
  (pad "4" thru_hole oval (at 0 7.62) (size 1.7 1.7) (drill 0.25) (layers *.Cu *.Mask) (tstamp 0a948966-691f-498e-a665-a482011f729f))
  (pad "5" thru_hole oval (at 0 10.16) (size 1.7 1.7) (drill 0.25) (layers *.Cu *.Mask) (tstamp 17437872-0c95-4755-a79b-b307b1943a7e))
  (pad "6" thru_hole oval (at 0 12.7) (size 1.7 1.7) (drill 0.25) (layers *.Cu *.Mask) (tstamp ad087984-2519-42fb-8c12-67348f128de2))
  (pad "7" thru_hole oval (at 0 15.24) (size 1.7 1.7) (drill 0.25) (layers *.Cu *.Mask) (tstamp 5d359f18-a364-469f-81b1-6e085027198a))
)
