{
  "kind": "collectionType",
  "collectionName": "documents",
  "info": {
    "name": "Document",
    "description": ""
  },
  "options": {
    "increments": true,
    "timestamps": true,
    "draftAndPublish": true
  },
  "attributes": {
    "title": {
      "type": "string",
      "required": true
    },
    "slug": {
      "type": "string",
      "required": true,
      "regex": "^[a-z\\-\\/]+$"
    },
    "abstract": {
      "type": "text"
    },
    "body": {
      "type": "richtext",
      "required": true
    },
    "author": {
      "plugin": "users-permissions",
      "model": "user"
    },
    "locale": {
      "model": "locale"
    },
    "tags": {
      "collection": "tag"
    },
    "order": {
      "type": "integer",
      "default": 0
    }
  }
}
