{
    "run": {
        "info": {
            "run_uuid": "0125f51ff1244e1197151ce2d48be687",
            "experiment_id": "1",
            "run_name": "capricious-goat-148",
            "user_id": "gitlab-runner",
            "status": "FINISHED",
            "start_time": 1677383017845,
            "end_time": 1677383023329,
            "artifact_uri": "s3://mlflow/1/0125f51ff1244e1197151ce2d48be687/artifacts",
            "lifecycle_stage": "active",
            "run_id": "0125f51ff1244e1197151ce2d48be687"
        },
        "data": {
            "metrics": [
                {
                    "key": "rmse",
                    "value": 0.7931640229276851,
                    "timestamp": 1677383018354,
                    "step": 0
                },
                {
                    "key": "r2",
                    "value": 0.10862644997792614,
                    "timestamp": 1677383018427,
                    "step": 0
                },
                {
                    "key": "mae",
                    "value": 0.6271946374319586,
                    "timestamp": 1677383018498,
                    "step": 0
                }
            ],
            "params": [
                {
                    "key": "alpha",
                    "value": "0.5"
                },
                {
                    "key": "l1_ratio",
                    "value": "0.5"
                }
            ],
            "tags": [
                {
                    "key": "mlflow.user",
                    "value": "gitlab-runner"
                },
                {
                    "key": "mlflow.source.name",
                    "value": "train.py"
                },
                {
                    "key": "mlflow.source.type",
                    "value": "LOCAL"
                },
                {
                    "key": "mlflow.source.git.commit",
                    "value": "4092f307542f5f544ae0cfa8a8907d22787c1c57"
                },
                {
                    "key": "mlflow.runName",
                    "value": "capricious-goat-148"
                },
                {
                    "key": "mlflow.log-model.history",
                    "value": "[{\"run_id\": \"0125f51ff1244e1197151ce2d48be687\", \"artifact_path\": \"model\", \"utc_time_created\": \"2023-02-26 03:43:38.583728\", \"flavors\": {\"python_function\": {\"model_path\": \"model.pkl\", \"predict_fn\": \"predict\", \"loader_module\": \"mlflow.sklearn\", \"python_version\": \"3.10.9\", \"env\": {\"conda\": \"conda.yaml\", \"virtualenv\": \"python_env.yaml\"}}, \"sklearn\": {\"pickled_model\": \"model.pkl\", \"sklearn_version\": \"1.2.0\", \"serialization_format\": \"cloudpickle\", \"code\": null}}, \"model_uuid\": \"59c8e8dd906a460784c0eb1a9af594bf\", \"mlflow_version\": \"2.1.1\"}]"
                }
            ]
        }
    }
}