{
    "env": "dev",
    "debug": true,
    "unlicensed": false,
    "composer": {
        "domain": "",
        "route": "/staff",
        "protocol": "https:",
        "use_domain": true,
        "local_login": false
    },
    "app": {
        "title": "ACA Projects",
        "name": "ACA Projects",
        "description": "ACA Projects Staff Application made in Angular 5+",
        "short_name": "ACA",
        "code": "ACA",
        "login": {
            "forgot": false
        },
        "analytics": {
            "enabled": false,
            "tracking_id": ""
        },
        "logo": {
            "type": "img",
            "src": "assets/img/logo.svg",
            "inverse": "assets/img/logo-inverse.svg",
            "background": ""
        },
        "banner": {
            "enabled": true,
            "header": true,
            "home": false,
            "type": "color",
            "full": true,
            "allow_image_on_home": false,
            "src": "assets/img/caterer-03.jpg"
        },
        "copyright": "Copyright 2018 ACA Projects",
        "routing": false,
        "style": {
            "popout": true
        },
        "orgs": true,
        "users": {
            "visitors": true,
            "external": true,
            "can_add": true,
            "custom_orgs": true,
            "locate": true,
            "store": false
        },
        "schedule": {
            "enabled": true,
            "visitors": true,
            "new_visitors": true,
            "edit_visitors": true,
            "hide_visitor_bookings": true,
            "contacts": true,
            "popout": false
        },
        "contacts": {
            "enabled": true
        },
        "route_settings": {
            "book": "booking"
        },
        "lockers": {
            "enabled": true,
            "simple_filters": false
        },
        "menu": {
            "type": "sidebar",
            "footer": "circles",
            "named": false,
            "home": true,
            "reverse": true,
            "list": [
                {
                    "id": "home",
                    "name": "Home",
                    "items": []
                },
                {
                    "id": "book",
                    "name": "Book",
                    "items": []
                },
                {
                    "id": "explore",
                    "name": "Explore",
                    "items": [
                        {
                            "id": "explore/spaces",
                            "name": "Spaces"
                        },
                        {
                            "id": "explore/people",
                            "name": "People"
                        }
                    ]
                },
                {
                    "id": "schedule",
                    "name": "My Bookings",
                    "items": []
                },
                {
                    "id": "help",
                    "name": "Help",
                    "items": []
                },
                {
                    "id": "control",
                    "name": "Control",
                    "items": []
                },
                {
                    "id": "home",
                    "name": "Logout",
                    "query": {
                        "logout": true
                    },
                    "items": []
                }
            ]
        },
        "hide": {
            "heading": false
        },
        "page": {
            "titles": {
                "": "Home",
                "home": "Home",
                "book": "Book Space",
                "book/room": "Find Space",
                "book/attendees": "Manage Attendees",
                "book/results": "Booking Results",
                "explore": "Explore",
                "explore/spaces": "Spaces",
                "explore/people": "People",
                "visitor": "Book Visitor",
                "control": "Control"
            },
            "info": {
                "profile": "Welcome to your profile",
                "schedule": "Hello {{user}}, here is your schedule for today"
            }
        },
        "home": {
            "background": "assets/img/skyline.jpg",
            "disclaimer": ""
        },
        "wifi": {
            "background": "assets/img/skyline.jpg"
        },
        "tiles": [
            {
                "id": "book",
                "name": "Book",
                "color": "",
                "icon": {
                    "class": "material-icons",
                    "value": "add"
                }
            },
            {
                "id": "explore/spaces",
                "name": "Spaces",
                "color": "",
                "icon": {
                    "class": "material-icons",
                    "value": "map"
                }
            },
            {
                "id": "explore/people",
                "name": "People",
                "color": "",
                "icon": {
                    "class": "material-icons",
                    "value": "people"
                }
            },
            {
                "id": "schedule",
                "name": "My Bookings",
                "color": "",
                "icon": {
                    "class": "material-icons",
                    "value": "today"
                }
            },
            {
                "id": "help",
                "name": "Help",
                "color": "",
                "icon": {
                    "class": "material-icons",
                    "value": "help_outline"
                }
            },
            {
                "id": "control",
                "name": "Control",
                "color": "",
                "icon": {
                    "class": "material-icons",
                    "value": "settings_remote"
                }
            }
        ],
        "zones": {
            "enabled": false,
            "toggle": "room"
        },
        "booking": {
            "min_attendees": 0,
            "external_visitors": false,
            "recurrence": false,
            "max_days_ahead": 180,
            "max_length": 480,
            "default_length": 30,
            "min_length": 30,
            "multi_room": false,
            "title_prefix": "",
            "charge": false,
            "terms": false,
            "old_filters": false,
            "select_room_first": true,
            "privacy": false,
            "control": false,
            "lock_cancel": 0,
            "external_floors": [],
            "return_id": "",
            "fields": [
                {
                    "key": "date",
                    "label": "Date",
                    "icon": {
                        "class": "material-icons",
                        "value": "event"
                    },
                    "simple": true,
                    "description": "",
                    "control_type": "custom",
                    "required": true
                },
                {
                    "key": "start",
                    "label": "Start",
                    "icon": {
                        "class": "material-icons",
                        "value": "access_time"
                    },
                    "refs": [
                        "date"
                    ],
                    "simple": true,
                    "description": "",
                    "control_type": "custom",
                    "required": true
                },
                {
                    "key": "duration",
                    "label": "End",
                    "icon": {
                        "class": "material-icons",
                        "value": "access_time"
                    },
                    "refs": [
                        "date"
                    ],
                    "simple": true,
                    "description": "",
                    "control_type": "custom",
                    "required": true
                },
                {
                    "key": "recurrence",
                    "label": "Recurrence",
                    "no_label": true,
                    "no_status": true,
                    "icon": {
                        "class": "material-icons",
                        "value": "repeat"
                    },
                    "control_type": "custom",
                    "flex": true
                },
                {
                    "key": "attendees",
                    "label": "Attendees",
                    "icon": {
                        "class": "material-icons",
                        "value": "people"
                    },
                    "flex": true,
                    "description": "",
                    "control_type": "custom"
                },
                {
                    "key": "title",
                    "label": "Subject",
                    "icon": {
                        "class": "material-icons",
                        "value": "local_offer"
                    },
                    "simple": true,
                    "description": "",
                    "control_type": "text",
                    "required": true
                },
                {
                    "key": "description",
                    "label": "Description",
                    "icon": {
                        "class": "material-icons",
                        "value": "description"
                    },
                    "description": "",
                    "control_type": "custom",
                    "flex": true
                },
                {
                    "key": "extras",
                    "label": "Preferences",
                    "no_label": true,
                    "no_status": true,
                    "control_type": "custom",
                    "flex": true
                }
            ],
            "banner": {
                "enabled": true,
                "links": [
                    {
                        "id": "book",
                        "name": "Book Space"
                    },
                    {
                        "id": "book/visitor",
                        "name": "Book Visitor"
                    }
                ]
            }
        },
        "explore": {
            "old_overlay": false,
            "cblf": false,
            "control": false,
            "banner": {
                "search": true,
                "roles": true,
                "src": "assets/img/banner.jpg"
            }
        },
        "control": {
            "banner": {
                "search": true,
                "fullback": true,
                "background": "assets/img/caterer-02.jpg"
            }
        },
        "people_min_char": 0,
        "catering": {
            "enabled": true
        },
        "colors": {
            "rooms": {
                "available": "#317c36",
                "unavailable": "#cd212e",
                "not-bookable": "#e6e6e6",
                "pin": "#ff5252"
            },
            "desks": {
                "available-fill": "#8cd4da",
                "available-stroke": "#6ab2af",
                "unavailable-fill": "#ec9d99",
                "unavailable-stroke": "#ca7b77",
                "reserved-fill": "#FF9800",
                "reserved-stroke": "#E65100",
                "not-bookable-fill": "#e6e6e6",
                "not-bookable-stroke": "#c4c4c4"
            }
        },
        "help": {
            "type": "",
            "banner": {
                "enabled": false
            },
            "disclaimer": "",
            "tiles": [
                {
                    "name": "AV Support",
                    "description": "",
                    "src": "",
                    "color": "",
                    "link": "https://www.google.com"
                },
                {
                    "name": "IT Help",
                    "description": "",
                    "src": "",
                    "color": "",
                    "link": "https://www.acaprojects.com"
                },
                {
                    "name": "Emergency Contact",
                    "description": "",
                    "src": "",
                    "color": "",
                    "link": "https://www.ses.nsw.gov.au"
                },
                {
                    "name": "Website",
                    "description": "",
                    "src": "",
                    "color": "",
                    "link": "https://www.acaprojects.com"
                }
            ]
        },
        "map": {
            "simple": true,
            "info": true,
            "settings": true,
            "bookings": true,
            "keys": {
                "general": [
                    {
                        "id": "lifts",
                        "name": "Lifts",
                        "icon": {
                            "class": "material-icons",
                            "value": "location_city"
                        }
                    },
                    {
                        "id": "toilets",
                        "name": "Toilets",
                        "icon": {
                            "class": "material-icons",
                            "value": "accessibility"
                        }
                    },
                    {
                        "id": "stairs",
                        "name": "Stairs",
                        "icon": {
                            "class": "material-icons",
                            "value": "trending_up"
                        }
                    }
                ],
                "room": [
                    {
                        "id": "bookable",
                        "name": "Bookable",
                        "color": "#317c36"
                    },
                    {
                        "id": "in-use",
                        "name": "In use",
                        "color": "#cd212e"
                    },
                    {
                        "id": "no-book",
                        "name": "Not bookable",
                        "color": "#545654"
                    }
                ],
                "desk": [
                    {
                        "id": "bookable",
                        "name": "Bookable",
                        "color": "#317c36"
                    },
                    {
                        "id": "in-use",
                        "name": "In use",
                        "color": "#cd212e"
                    },
                    {
                        "id": "no-book",
                        "name": "Not bookable",
                        "color": "#545654"
                    }
                ],
                "zone": [
                    {
                        "id": "low",
                        "name": "Low Usage",
                        "color": "#317c36"
                    },
                    {
                        "id": "medium",
                        "name": "Medium Usage",
                        "color": "#f4a81d"
                    },
                    {
                        "id": "high",
                        "name": "High Usage",
                        "color": "#cd212e"
                    }
                ]
            }
        }
    },
    "mock": false
}
