{
  "metadata": [
    {
      "src": [
        {
          "files": [
            "AbreVinci.Curvacy/AbreVinci.Curvacy.csproj"
          ],
          "src": ".."
        }
      ],
      "dest": "api",
      "properties": {
        "TargetFramework": "net472"
      },
      "disableGitFeatures": false,
      "disableDefaultFilter": false
    }
  ],
  "build": {
    "template": [
      "default",
      "templates/curvacy"
    ],
    "content": [
      {
        "files": [
          "curvacy/**.md",
          "curvacy/**.yml",
          "api/**.md",
          "api/**.yml",
          "toc.yml",
          "*.md"
        ]
      }
    ],
    "resource": [
      {
        "files": [
          "images/**"
        ]
      }
    ],
    "overwrite": [
      {
        "files": [
          "apidoc/**.md"
        ],
        "exclude": [
          "obj/**",
          "_site/**"
        ]
      }
    ],
    "dest": "_site",
    "globalMetadataFiles": [],
    "fileMetadataFiles": [],
    "postProcessors": [],
    "markdownEngineName": "markdig",
    "noLangKeyword": false,
    "keepFileLink": false,
    "cleanupCacheHistory": false,
    "disableGitFeatures": false
  }
}
