{
  "version": 1,
  "isRoot": true,
  "tools": {
    "azuresigntool": {
      "version": "3.0.0",
      "commands": [
        "azuresigntool"
      ]
    },
    "nugetkeyvaultsigntool": {
      "version": "3.2.2",
      "commands": [
        "NuGetKeyVaultSignTool"
      ]
    },
    "cake.tool": {
      "version": "2.0.0",
      "commands": [
        "dotnet-cake"
      ]
    }
  }
}