// Jest Snapshot v1, https://goo.gl/fbAQLP

exports[`getHelloMessage Should return a string 1`] = `"Hello you !"`;

exports[`sayHello should log the default message if no name provided 1`] = `
[MockFunction] {
  "calls": [
    [
      "Hello you !",
    ],
  ],
  "results": [
    {
      "type": "return",
      "value": undefined,
    },
  ],
}
`;
