{
  "coverageDirectory": "./reports/tests/unit/coverage",
  "collectCoverage": true,
  "coverageReporters": [
    "cobertura",
    "json",
    "lcov",
    "text"
  ],
  "reporters": [
    "default",
    ["jest-junit",
      {
        "outputDirectory": "./reports/tests/unit",
        "outputName": "junit.xml"
    }],
    ["jest-html-reporters",
      {
        "publicPath": "./reports/tests/unit",
        "filename": "index.html"
    }]
  ]
}
