// Jest Snapshot v1, https://goo.gl/fbAQLP

exports[`toOptions() accept a function as first parameter 1`] = `
Object {
  "resolve": undefined,
  "resolver": [Function],
}
`;

exports[`toOptions() accept resolved field as parameter 1`] = `
Object {
  "resolve": "name",
  "resolver": [Function],
}
`;

exports[`toOptions() accept resolved field list as parameter 1`] = `
Object {
  "resolve": Array [
    "name",
  ],
  "resolver": [Function],
}
`;

exports[`toOptions() handle correctly default aggregation options 1`] = `
Object {
  "groupBy": Object {
    "aggregator": undefined,
    "limits": Object {
      "maxItems": 100,
      "maxWait": 23,
    },
    "path": false,
    "properties": Array [
      "abc",
    ],
    "query": true,
  },
  "resolve": undefined,
  "resolver": [Function],
}
`;

exports[`toOptions() handle correctly default options 1`] = `
Object {
  "groupBy": undefined,
  "resolve": "field",
  "resolver": [Function],
}
`;

exports[`toOptions() have default aggregation values 1`] = `
Object {
  "groupBy": Object {
    "aggregator": undefined,
    "limits": Object {
      "maxItems": 100,
      "maxWait": 100,
    },
    "path": false,
    "properties": Array [],
    "query": true,
  },
  "isMultifield": undefined,
  "resolve": undefined,
  "resolver": [Function],
}
`;

exports[`toOptions() mark the field as skipped if boolean value 1`] = `
Object {
  "resolve": undefined,
  "resolver": [Function],
  "skipped": true,
}
`;

exports[`toOptions() throw an exception if field declared twice 1`] = `
Object {
  "groupBy": undefined,
  "resolve": "field",
  "resolver": [Function],
}
`;

exports[`toResolver throw an exception if field declared twice 1`] = `[Error: Duplicate resolver declaration for fields: "field"]`;
