<?xml version="1.0" encoding="iso-8859-1"?>
<!-- Generator: Adobe Illustrator 19.0.0, SVG Export Plug-In . SVG Version: 6.00 Build 0)  -->
<svg xmlns="http://www.w3.org/2000/svg" xmlns:xlink="http://www.w3.org/1999/xlink" version="1.1" id="Capa_1" x="0px" y="0px" viewBox="0 0 510 510" style="enable-background:new 0 0 510 510;" xml:space="preserve" width="512" height="512">
<g>
	<g>
		<path style="fill:#B9ECFF;" d="M60,472.5L60,472.5c0-13.318-8.829-25.022-21.634-28.681l-9.231-2.638    C16.329,437.522,7.5,425.818,7.5,412.5v-45.171c0-16.474,13.355-29.829,29.829-29.829h45.342    c16.474,0,29.829,13.355,29.829,29.829V412.5c0,13.318-8.829,25.022-21.634,28.681l-9.231,2.638    C68.829,447.478,60,459.182,60,472.5L60,472.5z"/>
	</g>
	<g>
		<g>
			<path style="fill:#7FDDFF;" d="M96.14,439.094c2.368-1.199,4.536-2.696,6.47-4.437C100.241,435.855,98.074,437.352,96.14,439.094     z"/>
		</g>
	</g>
	<g>
		<path style="fill:#7FDDFF;" d="M352.5,390L352.5,390c0-13.318-8.829-25.022-21.634-28.681l-9.231-2.638    C308.829,355.022,300,343.318,300,330v-45.171C300,268.355,313.355,255,329.829,255h45.342C391.645,255,405,268.355,405,284.829    V330c0,13.318-8.829,25.022-21.634,28.681l-9.231,2.638C361.329,364.978,352.5,376.682,352.5,390L352.5,390z"/>
	</g>
	<g>
		<g>
			<path style="fill:#7FDDFF;" d="M388.64,356.594c2.368-1.199,4.536-2.696,6.47-4.437     C392.741,353.355,390.574,354.852,388.64,356.594z"/>
		</g>
	</g>
	<g>
		<path style="fill:#44C9F7;" d="M180,232.5L180,232.5c0-13.318-8.829-25.022-21.634-28.681l-9.231-2.638    c-12.806-3.659-21.634-15.363-21.634-28.681v-45.171c0-16.474,13.355-29.829,29.829-29.829h45.342    c16.474,0,29.829,13.355,29.829,29.829V172.5c0,13.318-8.829,25.022-21.634,28.681l-9.231,2.638    C188.829,207.478,180,219.182,180,232.5L180,232.5z"/>
	</g>
	<g>
		<g>
			<path style="fill:#7FDDFF;" d="M216.14,199.094c2.368-1.199,4.536-2.696,6.47-4.437     C220.241,195.855,218.074,197.352,216.14,199.094z"/>
		</g>
	</g>
	<g>
		<path style="fill:#1FB5F3;" d="M450,150L450,150c0-13.318-8.829-25.022-21.634-28.681l-9.231-2.638    C406.329,115.022,397.5,103.318,397.5,90V44.829C397.5,28.355,410.855,15,427.329,15h45.342c16.474,0,29.829,13.355,29.829,29.829    V90c0,13.318-8.829,25.022-21.634,28.681l-9.231,2.638C458.829,124.978,450,136.682,450,150L450,150z"/>
	</g>
	<g>
		<g>
			<path style="fill:#7FDDFF;" d="M486.14,116.594c2.368-1.199,4.536-2.696,6.47-4.437     C490.241,113.355,488.074,114.852,486.14,116.594z"/>
		</g>
	</g>
	<g>
		<rect x="52.5" y="487.5" width="15" height="15"/>
	</g>
	<g>
		<path d="M67.5,472.5h-15c0-9.917-6.66-18.746-16.195-21.47l-9.231-2.638C11.133,443.838,0,429.079,0,412.5v-45.171    C0,346.746,16.746,330,37.329,330h45.342C103.254,330,120,346.746,120,367.329V412.5c0,16.579-11.133,31.338-27.074,35.893    l-9.231,2.638C74.16,453.754,67.5,462.583,67.5,472.5z M37.329,345C25.017,345,15,355.017,15,367.329V412.5    c0,9.917,6.66,18.746,16.195,21.47l9.231,2.638c8.003,2.287,14.794,7.146,19.574,13.516c4.779-6.371,11.57-11.229,19.574-13.516    l9.231-2.638C98.34,431.246,105,422.417,105,412.5v-45.171C105,355.017,94.983,345,82.671,345H37.329z"/>
	</g>
	<g>
		<rect x="52.5" y="386.25" style="fill:#FFFFFF;" width="15" height="15"/>
	</g>
	<g>
		<rect x="345" y="405" width="15" height="15"/>
	</g>
	<g>
		<path d="M360,390h-15c0-9.917-6.66-18.746-16.195-21.47l-9.231-2.638C303.633,361.338,292.5,346.579,292.5,330v-45.171    c0-20.583,16.746-37.329,37.329-37.329h45.342c20.583,0,37.329,16.746,37.329,37.329V330c0,16.579-11.133,31.338-27.074,35.893    l-9.231,2.638C366.66,371.254,360,380.083,360,390z M329.829,262.5c-12.313,0-22.329,10.017-22.329,22.329V330    c0,9.917,6.66,18.746,16.195,21.47l9.231,2.638c8.003,2.287,14.794,7.146,19.574,13.516c4.779-6.371,11.57-11.229,19.574-13.516    l9.231-2.638c9.535-2.724,16.195-11.553,16.195-21.47v-45.171c0-12.313-10.017-22.329-22.329-22.329H329.829z"/>
	</g>
	<g>
		<rect x="345" y="303.75" style="fill:#FFFFFF;" width="15" height="15"/>
	</g>
	<g>
		<rect x="172.5" y="247.5" width="15" height="15"/>
	</g>
	<g>
		<path d="M187.5,232.5h-15c0-9.917-6.66-18.746-16.195-21.47l-9.231-2.638C131.133,203.838,120,189.079,120,172.5v-45.171    C120,106.746,136.746,90,157.329,90h45.342C223.254,90,240,106.746,240,127.329V172.5c0,16.579-11.133,31.338-27.074,35.893    l-9.231,2.638C194.16,213.754,187.5,222.583,187.5,232.5z M157.329,105C145.017,105,135,115.017,135,127.329V172.5    c0,9.917,6.66,18.746,16.195,21.47l9.231,2.638c8.003,2.287,14.794,7.146,19.574,13.516c4.779-6.371,11.57-11.229,19.574-13.516    l9.231-2.638C218.34,191.246,225,182.417,225,172.5v-45.171C225,115.017,214.983,105,202.671,105H157.329z"/>
	</g>
	<g>
		<rect x="172.5" y="146.25" style="fill:#FFFFFF;" width="15" height="15"/>
	</g>
	<g>
		<rect x="442.5" y="165" width="15" height="15"/>
	</g>
	<g>
		<path d="M457.5,150h-15c0-9.917-6.66-18.746-16.195-21.47l-9.231-2.638C401.133,121.338,390,106.579,390,90V44.829    C390,24.246,406.746,7.5,427.329,7.5h45.342C493.254,7.5,510,24.246,510,44.829V90c0,16.579-11.133,31.338-27.074,35.893    l-9.231,2.638C464.16,131.254,457.5,140.083,457.5,150z M427.329,22.5C415.017,22.5,405,32.517,405,44.829V90    c0,9.917,6.66,18.746,16.195,21.47l9.231,2.638c8.003,2.287,14.794,7.146,19.574,13.516c4.779-6.371,11.57-11.229,19.574-13.516    l9.231-2.638C488.34,108.746,495,99.917,495,90V44.829c0-12.313-10.017-22.329-22.329-22.329H427.329z"/>
	</g>
	<g>
		<rect x="442.5" y="63.75" style="fill:#FFFFFF;" width="15" height="15"/>
	</g>
	<g>
		<path d="M247.5,502.5h-165v-15h165c8.271,0,15-6.729,15-15s-6.729-15-15-15h-26.25c-14.474,0-26.25-11.776-26.25-26.25    S206.776,405,221.25,405H330v15H221.25c-6.203,0-11.25,5.047-11.25,11.25s5.047,11.25,11.25,11.25h26.25c16.542,0,30,13.458,30,30    S264.042,502.5,247.5,502.5z"/>
	</g>
	<g>
		<path d="M427.5,420H375v-15h52.5c12.407,0,22.5-10.093,22.5-22.5S439.907,360,427.5,360H420v-15h7.5    c20.678,0,37.5,16.822,37.5,37.5S448.178,420,427.5,420z"/>
	</g>
	<g>
		<path d="M277.5,360H180c-20.678,0-37.5-16.822-37.5-37.5v-3.75c0-10.339-8.411-18.75-18.75-18.75    c-14.474,0-26.25-11.776-26.25-26.25s11.776-26.25,26.25-26.25h33.75v15h-33.75c-6.203,0-11.25,5.047-11.25,11.25    S117.547,285,123.75,285c18.61,0,33.75,15.14,33.75,33.75v3.75c0,12.407,10.093,22.5,22.5,22.5h97.5V360z"/>
	</g>
	<g>
		<path d="M217.407,262.5H202.5v-15h14.907c22.239,0,43.147-8.66,58.873-24.386l29.335-29.335    C324.173,175.221,348.848,165,375.093,165H427.5v15h-52.407c-22.239,0-43.147,8.66-58.873,24.386l-29.335,29.335    C268.327,252.279,243.652,262.5,217.407,262.5z"/>
	</g>
</g>















</svg>
