[
  { "nome": "Contabilidade", "type": "accounting" },
  { "nome": "Aeroporto", "type": "airport" },
  { "nome": "Parque de diversões", "type": "amusement_park" },
  { "nome": "Aquário", "type": "aquarium" },
  { "nome": "Galeria de Arte", "type": "art_gallery" },
  { "nome": "Caixa Eletrônico", "type": "atm" },
  { "nome": "Padaria", "type": "bakery" },
  { "nome": "Banco", "type": "bank" },
  { "nome": "Bar", "type": "bar" },
  { "nome": "Salão de beleza", "type": "beauty_salon" },
  { "nome": "Loja de Bicicleta", "type": "bicycle_store" },
  { "nome": "Livraria", "type": "book_store" },
  { "nome": "Bowling", "type": "bowling_alley" },
  { "nome": "Estação de onibus", "type": "bus_station" },
  { "nome": "Café", "type": "cafe" },
  { "nome": "Área de camping", "type": "campground" },
  { "nome": "Vendedor de carros", "type": "car_dealer" },
  { "nome": "Alugeul de Carro", "type": "car_rental" },
  { "nome": "Reparo do carro", "type": "car_repair" },
  { "nome": "Lava-jato", "type": "car_wash" },
  { "nome": "Cassino", "type": "casino" },
  { "nome": "Cemitério", "type": "cemetery" },
  { "nome": "Igreja", "type": "church" },
  { "nome": "Prefeitura", "type": "city_hall" },
  { "nome": "Loja de roupas", "type": "clothing_store" },
  { "nome": "Loja de conveniência", "type": "convenience_store" },
  { "nome": "Tribunal", "type": "courthouse" },
  { "nome": "Dentista", "type": "dentist" },
  { "nome": "Loja de departamento", "type": "department_store" },
  { "nome": "Médico", "type": "doctor" },
  { "nome": "Eletricista", "type": "electrician" },
  { "nome": "Loja de eletrônicos", "type": "electronics_store" },
  { "nome": "Embaixada", "type": "embassy" },
  { "nome": "Corpo de Bombeiros", "type": "fire_station" },
  { "nome": "Florista", "type": "florist" },
  { "nome": "Funerária", "type": "funeral_home" },
  { "nome": "Loja de móveis", "type": "furniture_store" },
  { "nome": "Posto de gasolina", "type": "gas_station" },
  { "nome": "Academia", "type": "gym" },
  { "nome": "Cuidado capilar", "type": "hair_care" },
  { "nome": "Loja de Hardware", "type": "hardware_store" },
  { "nome": "hindu_temple", "type": "hindu_temple" },
  { "nome": "home_goods_store", "type": "home_goods_store" },
  { "nome": "hospital", "type": "hospital" },
  { "nome": "Agência de seguros", "type": "insurance_agency" },
  { "nome": "jewelry_store", "type": "jewelry_store" },
  { "nome": "Lavanderia", "type": "laundry" },
  { "nome": "Advogado", "type": "lawyer" },
  { "nome": "Biblioteca", "type": "library" },
  { "nome": "Liquor_store", "type": "liquor_store" },
  { "nome": "Local_government_office", "type": "local_government_office" },
  { "nome": "Chaveiro", "type": "locksmith" },
  { "nome": "Alojamento", "type": "lodging" },
  { "nome": "meal_delivery", "type": "meal_delivery" },
  { "nome": "meal_takeaway", "type": "meal_takeaway" },
  { "nome": "Mesquita", "type": "mosque" },
  { "nome": "movie_rental", "type": "movie_rental" },
  { "nome": "Cinema", "type": "movie_theater" },
  { "nome": "moving_company", "type": "moving_company" },
  { "nome": "Museu", "type": "museum" },
  { "nome": "Boate", "type": "night_club" },
  { "nome": "Pintor", "type": "painter" },
  { "nome": "Parque", "type": "park" },
  { "nome": "Estacionamento", "type": "parking" },
  { "nome": "Loja de animais", "type": "pet_store" },
  { "nome": "Farmacia", "type": "pharmacy" },
  { "nome": "Fisioterapeuta", "type": "physiotherapist" },
  { "nome": "Encanador", "type": "plumber" },
  { "nome": "Polícia", "type": "police" },
  { "nome": "Agência dos Correios", "type": "post_office" },
  { "nome": "Agência imobiliária", "type": "real_estate_agency" },
  { "nome": "Restaurante", "type": "restaurant" },
  { "nome": "roofing_contractor", "type": "roofing_contractor" },
  { "nome": "rv_park", "type": "rv_park" },
  { "nome": "Escola", "type": "school" },
  { "nome": "Loja de sapatos", "type": "shoe_store" },
  { "nome": "Centro de compras", "type": "shopping_mall" },
  { "nome": "spa", "type": "spa" },
  { "nome": "Estádio", "type": "stadium" },
  { "nome": "Armazenamento", "type": "storage" },
  { "nome": "Loja", "type": "store" },
  { "nome": "Estação de metrô", "type": "subway_station" },
  { "nome": "Supermercado", "type": "supermarket" },
  { "nome": "Sinagoga", "type": "synagogue" },
  { "nome": "Ponto de taxi", "type": "taxi_stand" },
  { "nome": "Estação de trem", "type": "train_station" },
  { "nome": "transit_station", "type": "transit_station" },
  { "nome": "Agência de viagens", "type": "travel_agency" },
  { "nome": "veterinary_care", "type": "veterinary_care" },
  { "nome": "Zoológico", "type": "zoo" }
]
