{
"frames": {
	"analog_right_back.png": {
		"frame": {"x":0, "y":0, "w":112, "h":112},
		"spriteSourceSize": {"x":835,"y":390,"w":974,"h":523},
		"sourceSize": {"w":974,"h":523}
	},
	"analog_right_middle.png": {
		"frame": {"x":114, "y":0, "w":79, "h":79},
		"spriteSourceSize": {"x":852,"y":407,"w":974,"h":523},
		"sourceSize": {"w":974,"h":523}
	}

},
"meta": {
	"image": "rightAnalog.png",
	"size": {"w": 256, "h": 128},
	"scale": "1"
}
}
