{
"frames": {
	"mod_upper_C_C.png": {
		"frame": {"x":141, "y":31, "w":59, "h":29},
		"spriteSourceSize": {"x":250,"y":75,"w":781,"h":109},
		"sourceSize": {"w":781,"h":109}
	},
	"mod_upper_C_back.png": {
		"frame": {"x":0, "y":0, "w":139, "h":36},
		"spriteSourceSize": {"x":244,"y":72,"w":781,"h":109},
		"sourceSize": {"w":781,"h":109}
	},
	"mod_upper_C_\u00c7.png": {
		"frame": {"x":141, "y":0, "w":59, "h":29},
		"spriteSourceSize": {"x":318,"y":75,"w":781,"h":109},
		"sourceSize": {"w":781,"h":109}
	}

},
"meta": {
	"image": "mod_upper_c.png",
	"size": {"w": 256, "h": 64},
	"scale": "1"
}
}
