{
"frames": {
	"mod_lower_i_back.png": {
		"frame": {"x":0, "y":0, "w":208, "h":73},
		"spriteSourceSize": {"x":481,"y":1,"w":781,"h":109},
		"sourceSize": {"w":781,"h":109}
	},
	"mod_lower_i_i.png": {
		"frame": {"x":0, "y":199, "w":59, "h":29},
		"spriteSourceSize": {"x":487,"y":4,"w":781,"h":109},
		"sourceSize": {"w":781,"h":109}
	},
	"mod_lower_i_\u00ec.png": {
		"frame": {"x":0, "y":137, "w":59, "h":29},
		"spriteSourceSize": {"x":555,"y":4,"w":781,"h":109},
		"sourceSize": {"w":781,"h":109}
	},
	"mod_lower_i_\u00ed.png": {
		"frame": {"x":0, "y":75, "w":59, "h":29},
		"spriteSourceSize": {"x":623,"y":4,"w":781,"h":109},
		"sourceSize": {"w":781,"h":109}
	},
	"mod_lower_i_\u00ee.png": {
		"frame": {"x":0, "y":106, "w":59, "h":29},
		"spriteSourceSize": {"x":523,"y":40,"w":781,"h":109},
		"sourceSize": {"w":781,"h":109}
	},
	"mod_lower_i_\u00ef.png": {
		"frame": {"x":0, "y":168, "w":59, "h":29},
		"spriteSourceSize": {"x":592,"y":40,"w":781,"h":109},
		"sourceSize": {"w":781,"h":109}
	}

},
"meta": {
	"image": "mod_lower_i.png",
	"size": {"w": 256, "h": 256},
	"scale": "1"
}
}
