{
"frames": {
	"navBackground.png": {
		"frame": {"x":0, "y":0, "w":676, "h":61},
		"spriteSourceSize": {"x":152,"y":520,"w":980,"h":596},
		"sourceSize": {"w":980,"h":596}
	},
	"navButton02_ativo.png": {
		"frame": {"x":770, "y":0, "w":44, "h":44},
		"spriteSourceSize": {"x":162,"y":529,"w":980,"h":596},
		"sourceSize": {"w":980,"h":596}
	},
	"navButton02_atual.png": {
		"frame": {"x":736, "y":46, "w":44, "h":44},
		"spriteSourceSize": {"x":162,"y":529,"w":980,"h":596},
		"sourceSize": {"w":980,"h":596}
	},
	"navButton02_padrao.png": {
		"frame": {"x":724, "y":0, "w":44, "h":44},
		"spriteSourceSize": {"x":162,"y":529,"w":980,"h":596},
		"sourceSize": {"w":980,"h":596}
	},
	"navButton06_ativo.png": {
		"frame": {"x":690, "y":46, "w":44, "h":44},
		"spriteSourceSize": {"x":246,"y":529,"w":980,"h":596},
		"sourceSize": {"w":980,"h":596}
	},
	"navButton06_atual.png": {
		"frame": {"x":678, "y":0, "w":44, "h":44},
		"spriteSourceSize": {"x":246,"y":529,"w":980,"h":596},
		"sourceSize": {"w":980,"h":596}
	},
	"navButton06_padrao.png": {
		"frame": {"x":644, "y":63, "w":44, "h":44},
		"spriteSourceSize": {"x":246,"y":529,"w":980,"h":596},
		"sourceSize": {"w":980,"h":596}
	},
	"navButton10_ativo.png": {
		"frame": {"x":598, "y":63, "w":44, "h":44},
		"spriteSourceSize": {"x":330,"y":529,"w":980,"h":596},
		"sourceSize": {"w":980,"h":596}
	},
	"navButton10_atual.png": {
		"frame": {"x":552, "y":63, "w":44, "h":44},
		"spriteSourceSize": {"x":330,"y":529,"w":980,"h":596},
		"sourceSize": {"w":980,"h":596}
	},
	"navButton10_padrao.png": {
		"frame": {"x":782, "y":46, "w":44, "h":44},
		"spriteSourceSize": {"x":330,"y":529,"w":980,"h":596},
		"sourceSize": {"w":980,"h":596}
	},
	"navButton14_ativo.png": {
		"frame": {"x":460, "y":63, "w":44, "h":44},
		"spriteSourceSize": {"x":414,"y":529,"w":980,"h":596},
		"sourceSize": {"w":980,"h":596}
	},
	"navButton14_atual.png": {
		"frame": {"x":414, "y":63, "w":44, "h":44},
		"spriteSourceSize": {"x":414,"y":529,"w":980,"h":596},
		"sourceSize": {"w":980,"h":596}
	},
	"navButton14_padrao.png": {
		"frame": {"x":368, "y":63, "w":44, "h":44},
		"spriteSourceSize": {"x":414,"y":529,"w":980,"h":596},
		"sourceSize": {"w":980,"h":596}
	},
	"navButton18_ativo.png": {
		"frame": {"x":322, "y":63, "w":44, "h":44},
		"spriteSourceSize": {"x":498,"y":529,"w":980,"h":596},
		"sourceSize": {"w":980,"h":596}
	},
	"navButton18_atual.png": {
		"frame": {"x":276, "y":63, "w":44, "h":44},
		"spriteSourceSize": {"x":498,"y":529,"w":980,"h":596},
		"sourceSize": {"w":980,"h":596}
	},
	"navButton18_padrao.png": {
		"frame": {"x":506, "y":63, "w":44, "h":44},
		"spriteSourceSize": {"x":498,"y":529,"w":980,"h":596},
		"sourceSize": {"w":980,"h":596}
	},
	"navButton24_ativo.png": {
		"frame": {"x":184, "y":63, "w":44, "h":44},
		"spriteSourceSize": {"x":604,"y":529,"w":980,"h":596},
		"sourceSize": {"w":980,"h":596}
	},
	"navButton24_atual.png": {
		"frame": {"x":138, "y":63, "w":44, "h":44},
		"spriteSourceSize": {"x":604,"y":529,"w":980,"h":596},
		"sourceSize": {"w":980,"h":596}
	},
	"navButton24_padrao.png": {
		"frame": {"x":230, "y":63, "w":44, "h":44},
		"spriteSourceSize": {"x":604,"y":529,"w":980,"h":596},
		"sourceSize": {"w":980,"h":596}
	},
	"navButton26_ativo.png": {
		"frame": {"x":46, "y":63, "w":44, "h":44},
		"spriteSourceSize": {"x":666,"y":529,"w":980,"h":596},
		"sourceSize": {"w":980,"h":596}
	},
	"navButton26_atual.png": {
		"frame": {"x":92, "y":63, "w":44, "h":44},
		"spriteSourceSize": {"x":666,"y":529,"w":980,"h":596},
		"sourceSize": {"w":980,"h":596}
	},
	"navButton26_padrao.png": {
		"frame": {"x":0, "y":63, "w":44, "h":44},
		"spriteSourceSize": {"x":666,"y":529,"w":980,"h":596},
		"sourceSize": {"w":980,"h":596}
	},
	"navButton31_ativo.png": {
		"frame": {"x":770, "y":0, "w":44, "h":44},
		"spriteSourceSize": {"x":761,"y":529,"w":980,"h":596},
		"sourceSize": {"w":980,"h":596}
	},
	"navButton31_atual.png": {
		"frame": {"x":736, "y":46, "w":44, "h":44},
		"spriteSourceSize": {"x":761,"y":529,"w":980,"h":596},
		"sourceSize": {"w":980,"h":596}
	},
	"navButton31_padrao.png": {
		"frame": {"x":724, "y":0, "w":44, "h":44},
		"spriteSourceSize": {"x":761,"y":529,"w":980,"h":596},
		"sourceSize": {"w":980,"h":596}
	},
	"navIcon03_ativo.png": {
		"frame": {"x":10, "y":109, "w":8, "h":8},
		"spriteSourceSize": {"x":211,"y":547,"w":980,"h":596},
		"sourceSize": {"w":980,"h":596}
	},
	"navIcon03_atual.png": {
		"frame": {"x":0, "y":109, "w":8, "h":8},
		"spriteSourceSize": {"x":211,"y":547,"w":980,"h":596},
		"sourceSize": {"w":980,"h":596}
	},
	"navIcon03_padrao.png": {
		"frame": {"x":20, "y":109, "w":8, "h":8},
		"spriteSourceSize": {"x":211,"y":547,"w":980,"h":596},
		"sourceSize": {"w":980,"h":596}
	},
	"navIcon04_ativo.png": {
		"frame": {"x":10, "y":109, "w":8, "h":8},
		"spriteSourceSize": {"x":222,"y":547,"w":980,"h":596},
		"sourceSize": {"w":980,"h":596}
	},
	"navIcon04_atual.png": {
		"frame": {"x":0, "y":109, "w":8, "h":8},
		"spriteSourceSize": {"x":222,"y":547,"w":980,"h":596},
		"sourceSize": {"w":980,"h":596}
	},
	"navIcon04_padrao.png": {
		"frame": {"x":20, "y":109, "w":8, "h":8},
		"spriteSourceSize": {"x":222,"y":547,"w":980,"h":596},
		"sourceSize": {"w":980,"h":596}
	},
	"navIcon05_ativo.png": {
		"frame": {"x":10, "y":109, "w":8, "h":8},
		"spriteSourceSize": {"x":233,"y":547,"w":980,"h":596},
		"sourceSize": {"w":980,"h":596}
	},
	"navIcon05_atual.png": {
		"frame": {"x":0, "y":109, "w":8, "h":8},
		"spriteSourceSize": {"x":233,"y":547,"w":980,"h":596},
		"sourceSize": {"w":980,"h":596}
	},
	"navIcon05_padrao.png": {
		"frame": {"x":20, "y":109, "w":8, "h":8},
		"spriteSourceSize": {"x":233,"y":547,"w":980,"h":596},
		"sourceSize": {"w":980,"h":596}
	},
	"navIcon07_ativo.png": {
		"frame": {"x":10, "y":109, "w":8, "h":8},
		"spriteSourceSize": {"x":295,"y":547,"w":980,"h":596},
		"sourceSize": {"w":980,"h":596}
	},
	"navIcon07_atual.png": {
		"frame": {"x":0, "y":109, "w":8, "h":8},
		"spriteSourceSize": {"x":295,"y":547,"w":980,"h":596},
		"sourceSize": {"w":980,"h":596}
	},
	"navIcon07_padrao.png": {
		"frame": {"x":20, "y":109, "w":8, "h":8},
		"spriteSourceSize": {"x":295,"y":547,"w":980,"h":596},
		"sourceSize": {"w":980,"h":596}
	},
	"navIcon08_ativo.png": {
		"frame": {"x":10, "y":109, "w":8, "h":8},
		"spriteSourceSize": {"x":306,"y":547,"w":980,"h":596},
		"sourceSize": {"w":980,"h":596}
	},
	"navIcon08_atual.png": {
		"frame": {"x":0, "y":109, "w":8, "h":8},
		"spriteSourceSize": {"x":306,"y":547,"w":980,"h":596},
		"sourceSize": {"w":980,"h":596}
	},
	"navIcon08_padrao.png": {
		"frame": {"x":20, "y":109, "w":8, "h":8},
		"spriteSourceSize": {"x":306,"y":547,"w":980,"h":596},
		"sourceSize": {"w":980,"h":596}
	},
	"navIcon09_ativo.png": {
		"frame": {"x":10, "y":109, "w":8, "h":8},
		"spriteSourceSize": {"x":317,"y":547,"w":980,"h":596},
		"sourceSize": {"w":980,"h":596}
	},
	"navIcon09_atual.png": {
		"frame": {"x":0, "y":109, "w":8, "h":8},
		"spriteSourceSize": {"x":317,"y":547,"w":980,"h":596},
		"sourceSize": {"w":980,"h":596}
	},
	"navIcon09_padrao.png": {
		"frame": {"x":20, "y":109, "w":8, "h":8},
		"spriteSourceSize": {"x":317,"y":547,"w":980,"h":596},
		"sourceSize": {"w":980,"h":596}
	},
	"navIcon11_ativo.png": {
		"frame": {"x":10, "y":109, "w":8, "h":8},
		"spriteSourceSize": {"x":379,"y":547,"w":980,"h":596},
		"sourceSize": {"w":980,"h":596}
	},
	"navIcon11_atual.png": {
		"frame": {"x":0, "y":109, "w":8, "h":8},
		"spriteSourceSize": {"x":379,"y":547,"w":980,"h":596},
		"sourceSize": {"w":980,"h":596}
	},
	"navIcon11_padrao.png": {
		"frame": {"x":20, "y":109, "w":8, "h":8},
		"spriteSourceSize": {"x":379,"y":547,"w":980,"h":596},
		"sourceSize": {"w":980,"h":596}
	},
	"navIcon12_ativo.png": {
		"frame": {"x":10, "y":109, "w":8, "h":8},
		"spriteSourceSize": {"x":390,"y":547,"w":980,"h":596},
		"sourceSize": {"w":980,"h":596}
	},
	"navIcon12_atual.png": {
		"frame": {"x":0, "y":109, "w":8, "h":8},
		"spriteSourceSize": {"x":390,"y":547,"w":980,"h":596},
		"sourceSize": {"w":980,"h":596}
	},
	"navIcon12_padrao.png": {
		"frame": {"x":20, "y":109, "w":8, "h":8},
		"spriteSourceSize": {"x":390,"y":547,"w":980,"h":596},
		"sourceSize": {"w":980,"h":596}
	},
	"navIcon13_ativo.png": {
		"frame": {"x":10, "y":109, "w":8, "h":8},
		"spriteSourceSize": {"x":401,"y":547,"w":980,"h":596},
		"sourceSize": {"w":980,"h":596}
	},
	"navIcon13_atual.png": {
		"frame": {"x":0, "y":109, "w":8, "h":8},
		"spriteSourceSize": {"x":401,"y":547,"w":980,"h":596},
		"sourceSize": {"w":980,"h":596}
	},
	"navIcon13_padrao.png": {
		"frame": {"x":20, "y":109, "w":8, "h":8},
		"spriteSourceSize": {"x":401,"y":547,"w":980,"h":596},
		"sourceSize": {"w":980,"h":596}
	},
	"navIcon15_ativo.png": {
		"frame": {"x":10, "y":109, "w":8, "h":8},
		"spriteSourceSize": {"x":463,"y":547,"w":980,"h":596},
		"sourceSize": {"w":980,"h":596}
	},
	"navIcon15_atual.png": {
		"frame": {"x":0, "y":109, "w":8, "h":8},
		"spriteSourceSize": {"x":463,"y":547,"w":980,"h":596},
		"sourceSize": {"w":980,"h":596}
	},
	"navIcon15_padrao.png": {
		"frame": {"x":20, "y":109, "w":8, "h":8},
		"spriteSourceSize": {"x":463,"y":547,"w":980,"h":596},
		"sourceSize": {"w":980,"h":596}
	},
	"navIcon16_ativo.png": {
		"frame": {"x":10, "y":109, "w":8, "h":8},
		"spriteSourceSize": {"x":474,"y":547,"w":980,"h":596},
		"sourceSize": {"w":980,"h":596}
	},
	"navIcon16_atual.png": {
		"frame": {"x":0, "y":109, "w":8, "h":8},
		"spriteSourceSize": {"x":474,"y":547,"w":980,"h":596},
		"sourceSize": {"w":980,"h":596}
	},
	"navIcon16_padrao.png": {
		"frame": {"x":20, "y":109, "w":8, "h":8},
		"spriteSourceSize": {"x":474,"y":547,"w":980,"h":596},
		"sourceSize": {"w":980,"h":596}
	},
	"navIcon17_ativo.png": {
		"frame": {"x":10, "y":109, "w":8, "h":8},
		"spriteSourceSize": {"x":485,"y":547,"w":980,"h":596},
		"sourceSize": {"w":980,"h":596}
	},
	"navIcon17_atual.png": {
		"frame": {"x":0, "y":109, "w":8, "h":8},
		"spriteSourceSize": {"x":485,"y":547,"w":980,"h":596},
		"sourceSize": {"w":980,"h":596}
	},
	"navIcon17_padrao.png": {
		"frame": {"x":20, "y":109, "w":8, "h":8},
		"spriteSourceSize": {"x":485,"y":547,"w":980,"h":596},
		"sourceSize": {"w":980,"h":596}
	},
	"navIcon19_ativo.png": {
		"frame": {"x":10, "y":109, "w":8, "h":8},
		"spriteSourceSize": {"x":547,"y":547,"w":980,"h":596},
		"sourceSize": {"w":980,"h":596}
	},
	"navIcon19_atual.png": {
		"frame": {"x":0, "y":109, "w":8, "h":8},
		"spriteSourceSize": {"x":547,"y":547,"w":980,"h":596},
		"sourceSize": {"w":980,"h":596}
	},
	"navIcon19_padrao.png": {
		"frame": {"x":20, "y":109, "w":8, "h":8},
		"spriteSourceSize": {"x":547,"y":547,"w":980,"h":596},
		"sourceSize": {"w":980,"h":596}
	},
	"navIcon20_ativo.png": {
		"frame": {"x":10, "y":109, "w":8, "h":8},
		"spriteSourceSize": {"x":558,"y":547,"w":980,"h":596},
		"sourceSize": {"w":980,"h":596}
	},
	"navIcon20_atual.png": {
		"frame": {"x":0, "y":109, "w":8, "h":8},
		"spriteSourceSize": {"x":558,"y":547,"w":980,"h":596},
		"sourceSize": {"w":980,"h":596}
	},
	"navIcon20_padrao.png": {
		"frame": {"x":20, "y":109, "w":8, "h":8},
		"spriteSourceSize": {"x":558,"y":547,"w":980,"h":596},
		"sourceSize": {"w":980,"h":596}
	},
	"navIcon21_ativo.png": {
		"frame": {"x":10, "y":109, "w":8, "h":8},
		"spriteSourceSize": {"x":569,"y":547,"w":980,"h":596},
		"sourceSize": {"w":980,"h":596}
	},
	"navIcon21_atual.png": {
		"frame": {"x":0, "y":109, "w":8, "h":8},
		"spriteSourceSize": {"x":569,"y":547,"w":980,"h":596},
		"sourceSize": {"w":980,"h":596}
	},
	"navIcon21_padrao.png": {
		"frame": {"x":20, "y":109, "w":8, "h":8},
		"spriteSourceSize": {"x":569,"y":547,"w":980,"h":596},
		"sourceSize": {"w":980,"h":596}
	},
	"navIcon22_ativo.png": {
		"frame": {"x":10, "y":109, "w":8, "h":8},
		"spriteSourceSize": {"x":580,"y":547,"w":980,"h":596},
		"sourceSize": {"w":980,"h":596}
	},
	"navIcon22_atual.png": {
		"frame": {"x":0, "y":109, "w":8, "h":8},
		"spriteSourceSize": {"x":580,"y":547,"w":980,"h":596},
		"sourceSize": {"w":980,"h":596}
	},
	"navIcon22_padrao.png": {
		"frame": {"x":20, "y":109, "w":8, "h":8},
		"spriteSourceSize": {"x":580,"y":547,"w":980,"h":596},
		"sourceSize": {"w":980,"h":596}
	},
	"navIcon23_ativo.png": {
		"frame": {"x":10, "y":109, "w":8, "h":8},
		"spriteSourceSize": {"x":591,"y":547,"w":980,"h":596},
		"sourceSize": {"w":980,"h":596}
	},
	"navIcon23_atual.png": {
		"frame": {"x":0, "y":109, "w":8, "h":8},
		"spriteSourceSize": {"x":591,"y":547,"w":980,"h":596},
		"sourceSize": {"w":980,"h":596}
	},
	"navIcon23_padrao.png": {
		"frame": {"x":20, "y":109, "w":8, "h":8},
		"spriteSourceSize": {"x":591,"y":547,"w":980,"h":596},
		"sourceSize": {"w":980,"h":596}
	},
	"navIcon25_ativo.png": {
		"frame": {"x":10, "y":109, "w":8, "h":8},
		"spriteSourceSize": {"x":653,"y":547,"w":980,"h":596},
		"sourceSize": {"w":980,"h":596}
	},
	"navIcon25_atual.png": {
		"frame": {"x":0, "y":109, "w":8, "h":8},
		"spriteSourceSize": {"x":653,"y":547,"w":980,"h":596},
		"sourceSize": {"w":980,"h":596}
	},
	"navIcon25_padrao.png": {
		"frame": {"x":20, "y":109, "w":8, "h":8},
		"spriteSourceSize": {"x":653,"y":547,"w":980,"h":596},
		"sourceSize": {"w":980,"h":596}
	},
	"navIcon27_ativo.png": {
		"frame": {"x":10, "y":109, "w":8, "h":8},
		"spriteSourceSize": {"x":715,"y":547,"w":980,"h":596},
		"sourceSize": {"w":980,"h":596}
	},
	"navIcon27_atual.png": {
		"frame": {"x":0, "y":109, "w":8, "h":8},
		"spriteSourceSize": {"x":715,"y":547,"w":980,"h":596},
		"sourceSize": {"w":980,"h":596}
	},
	"navIcon27_padrao.png": {
		"frame": {"x":20, "y":109, "w":8, "h":8},
		"spriteSourceSize": {"x":715,"y":547,"w":980,"h":596},
		"sourceSize": {"w":980,"h":596}
	},
	"navIcon28_ativo.png": {
		"frame": {"x":10, "y":109, "w":8, "h":8},
		"spriteSourceSize": {"x":726,"y":547,"w":980,"h":596},
		"sourceSize": {"w":980,"h":596}
	},
	"navIcon28_atual.png": {
		"frame": {"x":0, "y":109, "w":8, "h":8},
		"spriteSourceSize": {"x":726,"y":547,"w":980,"h":596},
		"sourceSize": {"w":980,"h":596}
	},
	"navIcon28_padrao.png": {
		"frame": {"x":20, "y":109, "w":8, "h":8},
		"spriteSourceSize": {"x":726,"y":547,"w":980,"h":596},
		"sourceSize": {"w":980,"h":596}
	},
	"navIcon29_ativo.png": {
		"frame": {"x":10, "y":109, "w":8, "h":8},
		"spriteSourceSize": {"x":737,"y":547,"w":980,"h":596},
		"sourceSize": {"w":980,"h":596}
	},
	"navIcon29_atual.png": {
		"frame": {"x":0, "y":109, "w":8, "h":8},
		"spriteSourceSize": {"x":737,"y":547,"w":980,"h":596},
		"sourceSize": {"w":980,"h":596}
	},
	"navIcon29_padrao.png": {
		"frame": {"x":20, "y":109, "w":8, "h":8},
		"spriteSourceSize": {"x":737,"y":547,"w":980,"h":596},
		"sourceSize": {"w":980,"h":596}
	},
	"navIcon30_ativo.png": {
		"frame": {"x":10, "y":109, "w":8, "h":8},
		"spriteSourceSize": {"x":748,"y":547,"w":980,"h":596},
		"sourceSize": {"w":980,"h":596}
	},
	"navIcon30_atual.png": {
		"frame": {"x":0, "y":109, "w":8, "h":8},
		"spriteSourceSize": {"x":748,"y":547,"w":980,"h":596},
		"sourceSize": {"w":980,"h":596}
	},
	"navIcon30_padrao.png": {
		"frame": {"x":20, "y":109, "w":8, "h":8},
		"spriteSourceSize": {"x":748,"y":547,"w":980,"h":596},
		"sourceSize": {"w":980,"h":596}
	},
	"navIcon32_ativo.png": {
		"frame": {"x":10, "y":109, "w":8, "h":8},
		"spriteSourceSize": {"x":810,"y":547,"w":980,"h":596},
		"sourceSize": {"w":980,"h":596}
	},
	"navIcon32_atual.png": {
		"frame": {"x":0, "y":109, "w":8, "h":8},
		"spriteSourceSize": {"x":810,"y":547,"w":980,"h":596},
		"sourceSize": {"w":980,"h":596}
	},
	"navIcon32_padrao.png": {
		"frame": {"x":20, "y":109, "w":8, "h":8},
		"spriteSourceSize": {"x":810,"y":547,"w":980,"h":596},
		"sourceSize": {"w":980,"h":596}
	}

},
"meta": {
	"image": "sprites.png",
	"size": {"w": 1024, "h": 128},
	"scale": "1"
}
}