{
"frames": {
	"boca_clovis1-02.png": {
		"frame": {"x":0, "y":68, "w":131, "h":66},
		"spriteSourceSize": {"x":0,"y":0,"w":131,"h":66},
		"sourceSize": {"w":131,"h":66}
	},
	"boca_clovis2-02.png": {
		"frame": {"x":0, "y":0, "w":131, "h":66},
		"spriteSourceSize": {"x":0,"y":0,"w":131,"h":66},
		"sourceSize": {"w":131,"h":66}
	},
	"boca_clovis3-02.png": {
		"frame": {"x":0, "y":136, "w":131, "h":66},
		"spriteSourceSize": {"x":0,"y":0,"w":131,"h":66},
		"sourceSize": {"w":131,"h":66}
	},
	"boca_clovis4-02.png": {
		"frame": {"x":0, "y":272, "w":131, "h":66},
		"spriteSourceSize": {"x":0,"y":0,"w":131,"h":66},
		"sourceSize": {"w":131,"h":66}
	},
	"boca_clovis5-02.png": {
		"frame": {"x":0, "y":204, "w":131, "h":66},
		"spriteSourceSize": {"x":0,"y":0,"w":131,"h":66},
		"sourceSize": {"w":131,"h":66}
	},
	"boca_clovis6-02.png": {
		"frame": {"x":0, "y":340, "w":131, "h":66},
		"spriteSourceSize": {"x":0,"y":0,"w":131,"h":66},
		"sourceSize": {"w":131,"h":66}
	}

},
"meta": {
	"image": "bocaClovis.png",
	"size": {"w": 256, "h": 512},
	"scale": "1"
}
}