{
"frames": {
	"mod_lower_s_back.png": {
		"frame": {"x":0, "y":0, "w":140, "h":38},
		"spriteSourceSize": {"x":95,"y":35,"w":781,"h":109},
		"sourceSize": {"w":781,"h":109}
	},
	"mod_lower_s_s.png": {
		"frame": {"x":142, "y":31, "w":59, "h":29},
		"spriteSourceSize": {"x":101,"y":40,"w":781,"h":109},
		"sourceSize": {"w":781,"h":109}
	},
	"mod_lower_s_\u0161.png": {
		"frame": {"x":142, "y":0, "w":59, "h":29},
		"spriteSourceSize": {"x":170,"y":40,"w":781,"h":109},
		"sourceSize": {"w":781,"h":109}
	}

},
"meta": {
	"image": "mod_lower_s.png",
	"size": {"w": 256, "h": 64},
	"scale": "1"
}
}
