{
"frames": {
	"mod_lower_c_back.png": {
		"frame": {"x":0, "y":0, "w":137, "h":37},
		"spriteSourceSize": {"x":245,"y":71,"w":781,"h":109},
		"sourceSize": {"w":781,"h":109}
	},
	"mod_lower_c_c.png": {
		"frame": {"x":139, "y":31, "w":59, "h":29},
		"spriteSourceSize": {"x":250,"y":75,"w":781,"h":109},
		"sourceSize": {"w":781,"h":109}
	},
	"mod_lower_c_\u00e7.png": {
		"frame": {"x":139, "y":0, "w":59, "h":29},
		"spriteSourceSize": {"x":318,"y":75,"w":781,"h":109},
		"sourceSize": {"w":781,"h":109}
	}

},
"meta": {
	"image": "mod_lower_c.png",
	"size": {"w": 256, "h": 64},
	"scale": "1"
}
}
