{
"frames": {
	"focinhoCachorro02-01.png": {
		"frame": {"x":0, "y":0, "w":255, "h":136},
		"spriteSourceSize": {"x":0,"y":0,"w":255,"h":136},
		"sourceSize": {"w":255,"h":136}
	},
	"focinhoCachorro02-02.png": {
		"frame": {"x":0, "y":276, "w":255, "h":136},
		"spriteSourceSize": {"x":0,"y":0,"w":255,"h":136},
		"sourceSize": {"w":255,"h":136}
	},
	"focinhoCachorro02-03.png": {
		"frame": {"x":0, "y":552, "w":255, "h":136},
		"spriteSourceSize": {"x":0,"y":0,"w":255,"h":136},
		"sourceSize": {"w":255,"h":136}
	},
	"focinhoCachorro02-04.png": {
		"frame": {"x":0, "y":414, "w":255, "h":136},
		"spriteSourceSize": {"x":0,"y":0,"w":255,"h":136},
		"sourceSize": {"w":255,"h":136}
	},
	"focinhoCachorro02-05.png": {
		"frame": {"x":0, "y":690, "w":255, "h":136},
		"spriteSourceSize": {"x":0,"y":0,"w":255,"h":136},
		"sourceSize": {"w":255,"h":136}
	},
	"focinhoCachorro02-06.png": {
		"frame": {"x":0, "y":138, "w":255, "h":136},
		"spriteSourceSize": {"x":0,"y":0,"w":255,"h":136},
		"sourceSize": {"w":255,"h":136}
	}

},
"meta": {
	"image": "ananasfrente.png",
	"size": {"w": 512, "h": 1024},
	"scale": "1"
}
}