<svg xmlns="http://www.w3.org/2000/svg" width="267.17" height="359.399" viewBox="0 0 267.17 359.399">
  <g id="Component_9_1" data-name="Component 9 – 1" transform="translate(0.847 0.75)">
    <path id="Path_59" data-name="Path 59" d="M199.373,287.025l-36.9,2.367,42.555,75.554L173.1,453.092l40.963,26.1-.4-13.055s27.794-30.132,48.931-98.04S199.373,287.025,199.373,287.025Z" transform="translate(-89.743 -158.28)" fill="#e4eaf1"/>
    <path id="Path_60" data-name="Path 60" d="M274.534,434.785l-25.185-4.5-6.355,2.741,6.055,10.751-6.579,18.161h0s26.921,10.942,42.029,40.651q1.871-3.747,3.783-7.841C284.215,472.61,274.534,434.785,274.534,434.785Z" transform="translate(-133.763 -237.114)"/>
    <path id="Path_61" data-name="Path 61" d="M431.356,172.983H313.933l8.054-70.443H439.41Z" transform="translate(-173.087 -56.763)" fill="#e4eaf1"/>
    <path id="Path_62" data-name="Path 62" d="M420.987,159.623H303.565l8.054-70.443H429.041Z" transform="translate(-167.381 -49.411)" fill="none" stroke="#000" stroke-linecap="round" stroke-linejoin="round" stroke-width="1.5"/>
    <path id="Path_63" data-name="Path 63" d="M429,272.522l3.054-26.706H413.273l-3.054,26.706Z" transform="translate(-226.071 -135.604)"/>
    <path id="Path_64" data-name="Path 64" d="M249.239,457.884S241.006,298.494,131.715,299l-51.874,12.75s-12.9,70.731,95.032,66.684L214,479.621l42.5-14.84Z" transform="translate(-44.008 -164.872)" fill="#e4eaf1"/>
    <path id="Path_65" data-name="Path 65" d="M313.3,457.884S305.066,298.494,195.775,299" transform="translate(-108.067 -164.872)" fill="none" stroke="#000" stroke-linecap="round" stroke-linejoin="round" stroke-width="1.5"/>
    <path id="Path_66" data-name="Path 66" d="M79.841,327.356s-12.9,70.731,95.032,66.684L214,495.223" transform="translate(-44.008 -180.473)" fill="none" stroke="#000" stroke-linecap="round" stroke-linejoin="round" stroke-width="1.5"/>
    <g id="Group_19" data-name="Group 19" transform="translate(59.041 3.807)">
      <path id="Path_67" data-name="Path 67" d="M159.807,22.456V41.713l-23.856,5.863v-32.5l23.856-5.863Z" transform="translate(-134.189 -9.215)" fill="#e4eaf1"/>
      <circle id="Ellipse_1" data-name="Ellipse 1" cx="0.638" cy="0.638" r="0.638" transform="translate(11.505 18.627)"/>
      <circle id="Ellipse_2" data-name="Ellipse 2" cx="0.638" cy="0.638" r="0.638" transform="translate(21.302 18.627)"/>
      <path id="Path_68" data-name="Path 68" d="M174.425,48.486v-9.83h4.924" transform="translate(-155.36 -25.416)" fill="none" stroke="#000" stroke-linecap="round" stroke-linejoin="round" stroke-width="1.5"/>
      <line id="Line_1" data-name="Line 1" x2="4.924" transform="translate(10.941 13.24)" fill="none" stroke="#000" stroke-linecap="round" stroke-linejoin="round" stroke-width="1.5"/>
      <g id="Group_18" data-name="Group 18" transform="translate(0 16.605)">
        <path id="Path_69" data-name="Path 69" d="M135.366,47.81v3.413a3.334,3.334,0,0,1-3.334-3.334q0-.153.013-.3C132.233,45.515,135.366,45.731,135.366,47.81Z" transform="translate(-132.032 -46.137)" fill="#e4eaf1"/>
        <path id="Path_70" data-name="Path 70" d="M135.366,53.366a3.334,3.334,0,0,1-3.334-3.334" transform="translate(-132.032 -48.28)" fill="none" stroke="#000" stroke-linecap="round" stroke-linejoin="round" stroke-width="1.5"/>
      </g>
      <path id="Path_71" data-name="Path 71" d="M3.374,3.374A3.374,3.374,0,0,1,0,0" transform="matrix(-0.966, 0.259, -0.259, -0.966, 18.047, 28.783)" fill="none" stroke="#000" stroke-linecap="round" stroke-linejoin="round" stroke-width="1.5"/>
      <line id="Line_2" data-name="Line 2" x1="23.856" y2="5.863" transform="translate(1.763 32.497)" fill="none" stroke="#000" stroke-linecap="round" stroke-linejoin="round" stroke-width="1.5"/>
      <line id="Line_3" data-name="Line 3" x1="2.154" y2="0.529" transform="translate(16.912 23.078)" fill="none" stroke="#000" stroke-linecap="round" stroke-linejoin="round" stroke-width="1.5"/>
    </g>
    <path id="Path_72" data-name="Path 72" d="M154.225,131.883v52.093l-73.8,18.138V144.1a44.688,44.688,0,0,1,34.022-43.4h0a32.111,32.111,0,0,1,39.775,31.183Z" transform="translate(-44.595 -55.231)" fill="#ff6498"/>
    <path id="Path_73" data-name="Path 73" d="M133.279,21.162a19.394,19.394,0,0,0,3.815-7.69s14.153,4.666,19.957-3.148a7.724,7.724,0,0,0,.172-9.039,1.064,1.064,0,0,0-1.824-.036c-.575,1.005-1.927,1.83-5.094.643-5.337-2-16.444-1.349-18.214,5.4,0,0-7.87,2.192-1.11,13.97" transform="translate(-70.904 -0.75)" fill="none" stroke="#000" stroke-linecap="round" stroke-linejoin="round" stroke-width="1.5"/>
    <line id="Line_4" data-name="Line 4" x2="160.684" transform="translate(102.671 136.918)" fill="none" stroke="#000" stroke-linecap="round" stroke-linejoin="round" stroke-width="1.5"/>
    <path id="Path_74" data-name="Path 74" d="M72.355,119.183S41.936,144.164,34.29,184.54s52.976,30.674,81.85,18.789" transform="translate(-18.843 -65.921)" fill="none" stroke="#000" stroke-linecap="round" stroke-linejoin="round" stroke-width="1.5"/>
    <path id="Path_75" data-name="Path 75" d="M106.6,256.216s68.583-12.123,73.305,17.911" transform="translate(-58.996 -139.996)" fill="none" stroke="#000" stroke-linecap="round" stroke-linejoin="round" stroke-width="1.5"/>
    <path id="Path_76" data-name="Path 76" d="M222.037,119.183s21.523,22.21,27.2,62.958c0,0,21.831.751,22.7,17.911" transform="translate(-122.519 -65.921)" fill="none" stroke="#000" stroke-linecap="round" stroke-linejoin="round" stroke-width="1.5"/>
    <path id="Path_77" data-name="Path 77" d="M41.564,136.327s-9.782-20.31-17.877-2.771-43.467,133.118-6.14,152.457,91.911,8.717,91.911,8.717" transform="translate(-0.75 -69.903)" fill="none" stroke="#000" stroke-linecap="round" stroke-linejoin="round" stroke-width="1.5"/>
    <path id="Path_78" data-name="Path 78" d="M96.805,507.142V637.3H53.943" transform="translate(-29.348 -279.405)" fill="none" stroke="#000" stroke-linecap="round" stroke-linejoin="round" stroke-width="1.5"/>
    <g id="Group_165" data-name="Group 165" transform="translate(193.13 79.353)">
      <path id="Path_170" data-name="Path 170" d="M0,0A5.961,5.961,0,0,0,5.961,5.961,5.961,5.961,0,0,0,11.923,0" transform="translate(11.923 5.961) rotate(180)" fill="none" stroke="#000" stroke-miterlimit="10" stroke-width="1.5"/>
    </g>
    <g id="Ellipse_5" data-name="Ellipse 5" transform="translate(192.233 70.478)" fill="none" stroke="#000" stroke-width="1.5">
      <ellipse cx="2.933" cy="2.514" rx="2.933" ry="2.514" stroke="none"/>
      <ellipse cx="2.933" cy="2.514" rx="2.183" ry="1.764" fill="none"/>
    </g>
    <g id="Ellipse_6" data-name="Ellipse 6" transform="translate(199.774 70.478)" fill="none" stroke="#000" stroke-width="1.5">
      <circle cx="2.514" cy="2.514" r="2.514" stroke="none"/>
      <circle cx="2.514" cy="2.514" r="1.764" fill="none"/>
    </g>
  </g>
</svg>
