<svg xmlns="http://www.w3.org/2000/svg" xmlns:xlink="http://www.w3.org/1999/xlink" width="1360.409" height="434" viewBox="0 0 1360.409 434">
  <defs>
    <linearGradient id="linear-gradient" x1="0.5" x2="0.5" y2="1" gradientUnits="objectBoundingBox">
      <stop offset="0" stop-color="#fff"/>
      <stop offset="0.477" stop-color="#fff"/>
      <stop offset="1" stop-color="#f2f5f8"/>
    </linearGradient>
  </defs>
  <path id="Path_264" data-name="Path 264" d="M0,0H1360.409V434H217C97.154,434,0,336.846,0,217Z" transform="translate(1360.409 434) rotate(180)" fill="url(#linear-gradient)"/>
</svg>
