<svg id="Group_93" data-name="Group 93" xmlns="http://www.w3.org/2000/svg" width="86.167" height="109.037" viewBox="0 0 86.167 109.037">
  <circle id="Ellipse_3" data-name="Ellipse 3" cx="6.565" cy="6.565" r="6.565" transform="translate(36.518 95.907)" fill="#2edaf4"/>
  <path id="Path_123" data-name="Path 123" d="M85.417,277.167a60.368,60.368,0,0,0-84.667,0Z" transform="translate(0 -176.37)" fill="#e4eaf1"/>
  <line id="Line_5" data-name="Line 5" y2="82.955" transform="translate(43.083 0.75)" fill="none" stroke="#000" stroke-linecap="round" stroke-linejoin="round" stroke-width="1.5"/>
  <path id="Path_124" data-name="Path 124" d="M.75,277.167H85.417a60.183,60.183,0,0,0-42.334-17.331" transform="translate(0 -176.37)" fill="none" stroke="#000" stroke-linecap="round" stroke-linejoin="round" stroke-width="1.5"/>
</svg>
