[
  {
    "disabled": false,
    "displayName": "App Engine default service account",
    "email": "enduring-grid-93501@appspot.gserviceaccount.com",
    "etag": "MDEwMjE5MjA=",
    "name": "projects/enduring-grid-93501/serviceAccounts/enduring-grid-93501@appspot.gserviceaccount.com",
    "oauth2ClientId": "106957562054279986504",
    "projectId": "enduring-grid-93501",
    "uniqueId": "106957562054279986504"
  },
  {
    "disabled": false,
    "email": "vision-quickstart@enduring-grid-93501.iam.gserviceaccount.com",
    "etag": "MDEwMjE5MjA=",
    "name": "projects/enduring-grid-93501/serviceAccounts/vision-quickstart@enduring-grid-93501.iam.gserviceaccount.com",
    "oauth2ClientId": "110276950416980872381",
    "projectId": "enduring-grid-93501",
    "uniqueId": "110276950416980872381"
  },
  {
    "disabled": false,
    "displayName": "Container Engine Stackdriver Agent",
    "email": "container-engine-stackdriver-a@enduring-grid-93501.iam.gserviceaccount.com",
    "etag": "MDEwMjE5MjA=",
    "name": "projects/enduring-grid-93501/serviceAccounts/container-engine-stackdriver-a@enduring-grid-93501.iam.gserviceaccount.com",
    "oauth2ClientId": "115632831918307908636",
    "projectId": "enduring-grid-93501",
    "uniqueId": "115632831918307908636"
  },
  {
    "description": "For TM testing",
    "disabled": false,
    "displayName": "rn-tm-testing",
    "email": "rn-tm-testing@enduring-grid-93501.iam.gserviceaccount.com",
    "etag": "MDEwMjE5MjA=",
    "name": "projects/enduring-grid-93501/serviceAccounts/rn-tm-testing@enduring-grid-93501.iam.gserviceaccount.com",
    "oauth2ClientId": "107873986941352425539",
    "projectId": "enduring-grid-93501",
    "uniqueId": "107873986941352425539"
  },
  {
    "disabled": false,
    "displayName": "Compute Engine default service account",
    "email": "863115785838-compute@developer.gserviceaccount.com",
    "etag": "MDEwMjE5MjA=",
    "name": "projects/enduring-grid-93501/serviceAccounts/863115785838-compute@developer.gserviceaccount.com",
    "oauth2ClientId": "112619181507978592292",
    "projectId": "enduring-grid-93501",
    "uniqueId": "112619181507978592292"
  }
]