{
  "exp_name": "question_answering_system",

  "batch_size": 256,
  "MAX_DOCUMENT_LENGTH": 65,
  "EMBEDDING_SIZE": 300,
  "NEURONS": 200,
  "EPOCHS": 15,
  "max_to_keep": 2,
  "how_many_models_save": 10,
  "MAX_early_stop_count": 5,
  "early_stop_count": 5,
  "max_acc": 0,
  "margin": 0.4,
  "max_loss": 10,
  "comet_api_key": "QdTxN7U4kmvaSzGklcAe4OO0a",
  "data_dir": "C:/Users/user/Desktop/internship",
  "summary_dir": "C:/Users/user/Desktop/internship/experiments/question_answering_system/summary",
  "checkpoint_dir": "C:/Users/user/Desktop/internship/experiments/question_answering_system/checkpoint"
}

