347555 978869
688558 918649
807435 295309
311356 694860
344609 178675
508764 696721
1410 53289
938310 811598
355681 131172
298917 660824
368562 272918
940760 850210
9524 627733
591207 40425
67014 979196
116002 116768
153603 558131
541378 168262
459876 214723
652780 666427
666415 281955
555498 466137
452674 874038
382571 704791
66293 917974
235833 237108
588165 950123
958986 769637
752244 738171
721686 314309
446722 417517
15068 30745
279366 666556
731494 469758
124383 359939
186256 423758
614709 104617
753973 518391
420801 179238
856606 758881
328976 677363
679843 259930
470518 814881
378677 549372
997493 909172
801275 661681
203997 887063
185671 904079
400177 493021
807203 897405
233655 801250
324232 867183
197378 361038
623713 981760
250807 42179
430553 473227
212282 672266
874786 472716
326155 142001
330189 850118
344301 296406
89717 549537
984190 903141
551538 784811
485379 335506
249766 707999
207405 192
520124 937852
791018 678232
627213 520646
336351 780101
953363 557543
142443 312090
441535 419002
20960 575735
500852 280401
596129 371884
310863 130083
557509 673595
840498 45296
856533 43385
540082 309538
749331 647918
794986 736803
384682 178391
259017 799566
849722 405282
931909 310154
361275 808014
677759 501710
279549 953210
734281 411298
123859 287610
132545 180877
475337 247757
102543 104925
992384 467524
937020 99701
964016 649436
231220 558485
921927 260148
461945 983724
743594 213156
646838 599244
490685 333425
588230 723994
518759 102707
74997 923080
393339 251530
736002 904143
470181 623271
296666 860279
460682 142268
601962 586824
149809 592025
213505 82631
484164 212831
356009 531179
934667 118160
240300 955290
392242 605133
866284 912104
259945 501519
214901 230263
815892 967647
100698 424133
162421 578538
753796 364954
2992 484560
542832 172371
135265 175414
429991 252816
599560 127174
680063 92016
738674 247887
241770 862977
524669 934872
423518 872826
477955 800144
676045 782234
612754 108554
773254 722810
788785 839538
443264 210734
322152 454571
968134 616964
499365 934134
113104 658529
151600 487956
374828 784468
331896 763765
658539 402591
481190 631897
308047 382785
949267 157188
10053 399099
613266 470363
998951 303107
80003 120143
293185 777241
445835 811355
796664 879758
666858 770411
471000 601081
822383 795972
862227 526364
529924 89140
199541 292617
229747 196703
84559 921880
349681 358311
600117 611298
227839 93521
27036 31516
643409 317955
322814 621664
856842 767102
169653 150156
858210 821603
125771 267831
18726 903558
299973 628431
193788 157953
249782 161510
447971 672748
638732 869567
866811 821444
713111 51165
534979 150723
499937 214513
749825 502533
3042 307704
10049 902422
204752 13804
967974 84427
194533 962912
142124 584758
993656 157888
270280 581481
678621 945448
460924 741511
984901 671617
693344 461113
421998 719388
902863 915142
452290 667517
62643 219300
757560 66698
720876 381309
893173 626574
66981 297792
548662 226496
939536 489979
343222 668437
418728 645991
257023 567506
984796 569102
444152 364741
218963 71329
27165 308189
75290 889550
834242 889981
664132 115861
512145 880018
197568 829684
515486 697572
509307 933469
660895 402635
960805 851646
26244 877491
157459 776231
755411 505484
299710 970896
576413 767249
876926 347778
896847 999166
185612 337927
30944 805814
4247 77801
468188 819063
619698 501768
72862 402872
545995 828268
262429 984757
331392 348777
972842 115037
631761 205115
971184 844397
517350 787134
611929 766767
380080 904318
220288 854924
514852 429587
707875 194256
881692 511258
843030 786056
178058 739719
873414 643344
708837 848780
207593 573866
744825 126479
516561 596109
877782 302956
477885 448792
902769 258363
4016 781195
358525 528137
