835628 690234
471090 297895
323002 903954
434930 743742
327503 628298
973802 245464
667381 983056
418206 631048
615585 130026
394313 529588
658669 947353
107085 371614
579849 190036
162998 515284
425735 66129
970680 417750
148338 899960
665329 253480
112704 866690
91644 987072
74889 228421
102329 791894
914315 326594
202067 294655
874482 642603
835796 702604
703277 322352
767348 688535
830226 957530
601864 955881
806728 816138
685431 608488
318836 390466
86073 490712
671281 299887
748682 905204
476244 169131
744490 417094
130160 836986
695401 906407
98467 662467
310105 225263
959892 661555
191549 66803
273173 999040
903910 823250
780866 799189
81495 585036
389290 468769
901980 422768
849303 955987
230732 525237
181327 344233
931591 409306
845183 136391
691601 728661
934510 449584
604104 105285
102404 832830
98972 552049
506434 252153
186248 48654
68017 525150
390822 108467
70743 445764
965284 960022
407399 764307
641680 110186
424384 519150
964396 92235
664155 899106
61141 2418
495866 337006
32882 408516
701981 947636
674536 686182
199329 259102
671997 626388
421341 235084
775307 294851
132111 700977
666781 414636
968175 146488
416488 273277
547048 791547
65208 997330
651985 481340
828353 288086
652179 186618
264619 891233
824591 764929
79799 624521
488162 903777
29712 933123
569931 297780
82654 67334
273223 999255
370056 345202
960157 50609
327902 98304
879372 215886
390432 412780
965173 411845
350230 964737
821935 546152
205824 43743
853352 122214
275356 728763
66279 139961
91808 181719
468515 480745
998115 816401
515326 16731
216213 658051
501672 339121
425022 7825
904264 542303
885515 644962
298127 321486
194694 184220
861663 957536
655291 193257
757074 696105
679829 704657
916808 622278
572359 227042
580415 346669
86553 654941
870452 514398
972198 770616
481113 256938
646018 924750
536594 836325
205607 449172
276907 960818
354039 958942
783578 103900
320674 987184
270252 535565
796069 165486
401564 827637
71444 71730
106784 112625
408356 493335
482988 208833
762638 776735
591720 903416
686387 146549
967598 34516
760230 400044
128381 702204
722560 706323
801124 670910
536017 205410
550083 142865
390359 637433
682725 372656
218538 877024
448902 65727
789643 916886
382408 18210
741562 328053
480020 623664
445835 912083
772709 642264
510551 551650
201465 895001
110311 456722
341230 46843
572328 756463
245728 682741
807563 655291
571650 468616
541621 873901
620518 738284
806450 51114
499723 195116
636159 863123
530288 263473
692232 12174
935593 317490
503100 816887
687817 169229
400294 532595
702492 490266
323931 138166
956052 361057
847617 583469
553838 420767
147431 744123
513786 322982
158415 316484
246503 839921
210696 959794
281718 736399
743103 405188
814636 557864
231142 676712
729295 737819
386041 538872
574210 408571
