75580 800393 509
646937 636385 416
662904 897012 525
300967 596151 470
405382 36010 443
639840 925849 525
572029 139170 470
974998 191162 525
799027 45155 509
90743 397059 443
481938 719928 509
253884 257805 363
570447 27106 470
46884 369457 443
876187 749309 525
828942 526316 509
918504 448338 525
859943 484287 525
143555 744014 509
322218 61246 443
881372 984100 507
985585 169388 525
182549 156114 383
327942 886237 525
412904 914816 525
968414 201801 525
272464 469218 449
436065 159505 449
178621 668463 509
452654 670003 509
829413 385324 509
502812 275818 449
506639 767957 509
645773 960750 525
467071 632553 509
701298 689163 442
423608 854928 525
913660 652198 525
723129 311033 509
562274 512539 452
491489 779019 509
835052 746176 468
125353 221727 386
567960 808525 509
686219 459532 509
151629 407283 443
80853 867108 525
36367 839183 525
129981 565701 470
663328 705133 504
273298 645931 509
839522 560909 525
13374 18505 279
510536 885981 525
474868 136261 449
771724 262463 509
244291 644901 509
36515 683222 509
288504 637436 509
339509 610858 470
317973 737072 509
117128 270887 443
555393 737499 509
726987 834039 468
666009 173988 509
474036 524883 470
306461 328290 384
16851 24057 282
184 334517 443
30399 29792 272
759824 60408 509
276957 157627 443
350659 585729 470
703901 389385 509
685068 196099 509
597595 100125 470
287393 245900 407
160652 722826 509
65440 746421 509
958160 177041 525
173858 897318 525
935540 783353 525
34362 92049 351
512210 675895 509
362103 23220 443
512617 527667 439
776847 705689 468
210800 163227 373
109880 463929 449
420951 433375 418
537919 246861 470
257013 728019 509
709051 30603 509
495700 2035 449
88281 166471 383
749025 713724 424
983654 309861 525
482673 321462 449
415483 200359 449
748205 970326 525
831374 34090 509
896263 728843 525
326021 850721 525
393708 218517 443
866122 311260 525
469840 717388 509
120840 701132 509
560102 467266 470
878269 971015 507
464958 169609 449
987167 904000 507
128369 169147 383
707080 666418 504
380202 83884 443
357628 843237 525
831058 542481 509
686397 117065 509
972035 214213 525
773421 964730 525
556006 995001 525
67981 750595 509
418283 539370 470
516902 103323 470
767806 127431 509
722013 934733 525
516909 534439 439
670482 421332 509
736782 828927 468
247652 196803 443
437206 591620 470
706274 765360 424
427929 720887 509
881588 182290 525
634685 452108 509
307219 159503 443
37875 119700 354
615377 828734 509
199486 396077 443
65569 613273 470
941549 974968 458
601810 566637 434
312933 633364 509
332004 14412 443
604877 38224 470
717297 956066 525
14853 735184 509
275054 279219 389
889681 15523 525
216506 965553 525
484438 618057 470
94286 176072 383
568212 58650 470
740615 379729 509
474526 80461 449
280350 381396 441
75588 465968 449
978750 115494 525
918053 145517 525
344216 576616 470
647674 344650 509
659704 359909 509
293281 717916 509
754235 447210 509
691816 342266 509
262714 674183 509
697286 24372 509
871746 332186 525
124095 489822 449
31788 934047 525
28606 142168 354
415946 476993 444
214887 757565 509
596833 230907 470
57217 42700 340
395122 394223 405
262048 64699 443
34056 101874 351
393703 181889 443
732487 923681 525
50987 925032 525
319537 208240 443
194096 544368 470
608144 615456 447
500464 959769 525
736990 550472 509
547725 724240 509
730942 739869 424
576152 493140 470
930332 892974 476
724670 487911 509
889237 950198 507
338906 705358 509
650879 961057 525
890362 769435 525
537537 520888 408
726396 739628 424
964611 20609 525
954743 458260 525
190049 622813 470
646872 31884 509
760221 59096 509
324748 394736 441
490913 530614 470
207697 44388 383
776804 666945 504
267406 861711 525
365443 654547 509
695185 482646 509
753312 151884 509
570379 962489 525
913437 576587 525
299542 420448 449
790076 49571 509
293126 950054 525
325550 972405 525
215787 328748 443
358080 974406 525
636888 752864 504
587133 948612 525
323276 456196 449
434662 602798 470
350898 153278 443
870359 841764 419
610642 176998 470
655650 864972 525
653567 198523 509
174187 921432 525
