527281 250391 470
93082 896997 525
702552 104303 509
552571 736311 509
948492 160312 525
949481 543102 525
109143 635100 509
547684 267102 470
591182 182542 470
708579 945091 525
998274 585281 525
772696 106003 509
315301 215679 443
380223 431438 449
898959 658720 525
432112 792459 509
85703 552650 470
560811 753473 509
763412 133245 509
643145 779984 504
593736 576605 434
700663 628195 442
299261 79559 443
268976 696822 509
173470 365249 443
859753 407792 525
609081 117938 470
678655 544905 509
231314 814150 509
753058 448421 509
359871 312335 441
442571 486937 444
709663 70185 509
439129 67163 449
852906 257902 525
674004 279408 509
116683 85790 354
232678 678602 509
805200 14909 509
140379 146005 375
65412 345771 443
212798 155548 383
85353 975446 525
799805 747283 468
998200 582366 525
307438 34029 443
54265 561837 470
156879 458101 449
388426 79961 443
301163 35063 443
421105 509346 444
750781 557093 509
62148 916936 525
873087 891027 445
664186 341489 509
841215 661867 525
114333 999302 525
963402 975793 458
45502 523939 470
703756 121440 509
382155 753261 509
230826 931170 525
974626 169756 525
76541 736574 509
485279 747850 509
657066 305288 509
644409 629881 416
878900 210910 525
434433 795429 509
650161 195748 509
946608 157643 525
869347 226707 525
231724 500179 449
757874 775072 468
477389 857819 525
62825 108128 354
548785 244499 470
368165 965023 525
305472 88135 443
765923 244658 509
176814 687363 509
964711 350925 525
509945 90033 449
313642 120220 443
293248 291142 358
580581 507050 470
818623 496083 509
222219 329349 443
408197 130308 443
254992 692541 509
118573 858282 525
281823 808645 509
610997 642526 509
170967 698210 509
459750 758483 509
531043 100800 470
263068 44081 443
125126 55734 354
198752 109007 383
689184 889350 525
347475 378831 423
749749 85665 509
176224 136663 383
520617 232142 470
935699 935438 414
936207 525122 525
677246 60840 509
247524 198449 443
981165 762017 525
1445 458221 449
423372 724398 509
809687 980023 525
488733 515775 470
626096 708487 509
2676 490825 449
74218 438813 449
368193 976027 525
208027 94646 383
410049 808568 509
382272 188787 443
786647 238984 509
237208 999886 525
717588 557400 509
347107 919779 525
216731 583027 470
833892 370754 509
987670 216160 525
241452 45340 443
789645 493925 509
389785 726765 509
493335 283085 449
189157 819152 509
750019 345154 509
700229 294539 509
356003 805950 509
818002 9963 509
827265 588365 509
838650 715724 525
665769 289080 509
398906 951438 525
947236 888668 507
889480 916044 476
52853 452843 449
176843 545069 470
928695 515693 525
857740 981827 507
489107 106654 449
182528 848807 525
979165 380785 525
831658 926875 525
752674 2256 509
81034 381797 443
949008 608574 525
950899 971126 458
560639 572721 421
929725 878876 476
343779 937100 525
338218 402376 441
84514 846718 525
361416 340822 441
1597 380091 443
359650 244333 441
320635 930392 525
376533 705942 509
141341 122107 344
828791 749763 468
116899 264205 443
65905 134178 354
205542 234681 443
813959 674440 504
841731 403526 525
230608 931780 525
199306 571687 470
609041 329172 470
701192 922736 525
150339 6620 375
772424 294894 509
467981 228086 449
115158 346894 443
989441 625856 525
693642 871334 525
539400 516583 439
412792 706843 509
174730 254438 443
955699 377286 525
485634 596100 470
424822 136671 449
228755 141963 386
79044 704319 509
654788 508593 509
342823 144499 443
532819 958836 525
555836 523256 452
494418 491771 426
163501 909735 525
460959 309495 449
173665 259793 443
674572 23320 509
494005 786663 509
421483 333610 449
430207 447241 400
439711 414371 418
145804 176967 383
265764 390192 441
878688 332748 525
625422 199609 470
502209 16909 449
