<?xml version="1.0" encoding="UTF-8"?>
<!DOCTYPE svg PUBLIC "-//W3C//DTD SVG 1.1//EN" "http://www.w3.org/Graphics/SVG/1.1/DTD/svg11.dtd">
<!-- Creator: CorelDRAW X7 -->
<svg xmlns="http://www.w3.org/2000/svg" xml:space="preserve" width="122px" height="122px" version="1.1" shape-rendering="geometricPrecision" text-rendering="geometricPrecision" image-rendering="optimizeQuality" fill-rule="evenodd" clip-rule="evenodd"
viewBox="0 0 37334 37334"
 xmlns:xlink="http://www.w3.org/1999/xlink">
 <g id="Layer_x0020_1">
  <metadata id="CorelCorpID_0Corel-Layer"/>
  <path fill="#666666" d="M18667 0c10309,0 18667,8357 18667,18667 0,10309 -8358,18667 -18667,18667 -10310,0 -18667,-8358 -18667,-18667 0,-10310 8357,-18667 18667,-18667zm0 13780c647,0 1172,525 1172,1172 0,433 -234,811 -583,1014 4,26 6,53 6,81l0 1308c0,327 -268,595 -595,595l0 0c-327,0 -596,-268 -596,-595l0 -1308c0,-28 3,-55 7,-81 -349,-203 -583,-581 -583,-1014 0,-647 525,-1172 1172,-1172zm-3415 -922l6829 0c656,0 1192,535 1192,1190l0 4008c0,655 -536,1192 -1192,1192l-6829 0c-655,0 -1191,-537 -1191,-1192l0 -4008c0,-655 536,-1190 1191,-1190zm344 -706l1204 0 0 -2483c0,-477 390,-867 867,-867l2000 0c477,0 867,390 867,867l0 2483 1203 0 0 -2904c0,-936 -765,-1701 -1701,-1701l-2738 0c-936,0 -1702,765 -1702,1701l0 2904zm-835 13804l7832 0c-40,638 -131,1444 -331,2253l-7176 0c-187,-792 -279,-1606 -325,-2253zm745 3556l6321 0 -32 72c-953,2087 -2580,2011 -3063,1996 -32,0 -106,0 -131,0 -401,0 -2185,-76 -3062,-1996l-33 -72zm3161 -24223c3561,0 6586,1799 7681,4302 278,455 439,1126 439,2070 0,7136 -4137,6615 -4170,13082l-3409 0 -50 0 -38 0 -33 0 -55 0 -18 0 -66 0 -8 0 -74 0 -2 0 -75 0 -7 0 -70 0 -11 0 -68 0 -11 0 -70 0 -8 0 -74 0 -1 0 -76 0 -7 0 -66 0 -19 0 -54 0 -33 0 -38 0 -50 0 -3409 0c-33,-6467 -4170,-5946 -4170,-13082 0,-944 161,-1615 439,-2070 1095,-2503 4120,-4302 7681,-4302z"/>
 </g>
</svg>
