<?xml version="1.0" encoding="UTF-8"?>
<!DOCTYPE svg PUBLIC "-//W3C//DTD SVG 1.1//EN" "http://www.w3.org/Graphics/SVG/1.1/DTD/svg11.dtd">
<!-- Creator: CorelDRAW X7 -->
<svg xmlns="http://www.w3.org/2000/svg" xml:space="preserve" width="122px" height="122px" version="1.1" shape-rendering="geometricPrecision" text-rendering="geometricPrecision" image-rendering="optimizeQuality" fill-rule="evenodd" clip-rule="evenodd"
viewBox="0 0 37218 37218"
 xmlns:xlink="http://www.w3.org/1999/xlink">
 <g id="Layer_x0020_1">
  <metadata id="CorelCorpID_0Corel-Layer"/>
  <path fill="#666666" d="M18609 0c10278,0 18609,8332 18609,18609 0,10278 -8331,18609 -18609,18609 -10277,0 -18609,-8331 -18609,-18609 0,-10277 8332,-18609 18609,-18609zm-126 11911l1553 2887 3225 584 -2266 2369 441 3248 -2953 -1422 -2953 1422 440 -3248 -2265 -2369 3225 -584 1553 -2887zm-7813 -1829l15878 0c1433,0 2605,1172 2605,2605l0 8311c0,1433 -1172,2605 -2605,2605l-7319 0 -10359 5149 1785 -5149c-1426,-8 -2590,-1177 -2590,-2605l0 -8311c0,-1433 1172,-2605 2605,-2605z"/>
 </g>
</svg>
