<?xml version="1.0" encoding="UTF-8"?>
<!DOCTYPE svg PUBLIC "-//W3C//DTD SVG 1.1//EN" "http://www.w3.org/Graphics/SVG/1.1/DTD/svg11.dtd">
<!-- Creator: CorelDRAW X7 -->
<svg xmlns="http://www.w3.org/2000/svg" xml:space="preserve" width="115px" height="115px" version="1.1" shape-rendering="geometricPrecision" text-rendering="geometricPrecision" image-rendering="optimizeQuality" fill-rule="evenodd" clip-rule="evenodd"
viewBox="0 0 7469 7469"
 xmlns:xlink="http://www.w3.org/1999/xlink">
 <g id="Layer_x0020_1">
  <metadata id="CorelCorpID_0Corel-Layer"/>
  <path fill="gray" d="M2692 0l2084 0c1481,0 2693,1211 2693,2692l0 2085c0,1481 -1212,2692 -2693,2692l-2084 0c-1481,0 -2692,-1211 -2692,-2692l0 -2085c0,-1481 1211,-2692 2692,-2692zm1042 1855l0 0c230,0 418,188 418,418l0 1044 1044 0c230,0 418,188 418,418l0 0c0,229 -188,417 -418,417l-1044 0 0 1044c0,230 -188,418 -418,418l0 0c-230,0 -418,-188 -418,-418l0 -1044 -1043 0c-230,0 -418,-188 -418,-417l0 0c0,-230 188,-418 418,-418l1043 0 0 -1044c0,-230 188,-418 418,-418z"/>
 </g>
</svg>
