<?xml version="1.0" encoding="UTF-8"?>
<!DOCTYPE svg PUBLIC "-//W3C//DTD SVG 1.1//EN" "http://www.w3.org/Graphics/SVG/1.1/DTD/svg11.dtd">
<!-- Creator: CorelDRAW X7 -->
<svg xmlns="http://www.w3.org/2000/svg" xml:space="preserve" width="122px" height="122px" version="1.1" shape-rendering="geometricPrecision" text-rendering="geometricPrecision" image-rendering="optimizeQuality" fill-rule="evenodd" clip-rule="evenodd"
viewBox="0 0 34295 34295"
 xmlns:xlink="http://www.w3.org/1999/xlink">
 <g id="Layer_x0020_1">
  <metadata id="CorelCorpID_0Corel-Layer"/>
  <path fill="#666666" d="M10948 18041c-3437,1922 -5173,816 -5173,5495l7232 0 67 0 7113 0c0,-4509 -1753,-3556 -5173,-5495 -579,544 -1259,918 -2008,918 -782,0 -1480,-374 -2058,-918l0 0zm1752 -7215l528 0 0 -681 646 0 0 -527 -646 0 0 -681 -528 0 0 681 -630 0 0 527 630 0 0 681zm3420 1650l0 -3250c0,0 -3147,-2620 -6278,0l0 3250c0,0 1003,-935 3096,-969 2093,-34 3182,969 3182,969l0 0zm153 766c-102,-68 -187,-34 -238,68 0,0 17,-136 51,-340l-34 -34c-204,-205 -544,-409 -783,-528 -714,-374 -1531,-527 -2331,-510 -783,17 -1582,169 -2297,527 -238,119 -544,323 -731,511l-17 17c17,136 51,255 85,374 0,0 -136,-153 -307,0 -204,221 17,732 86,987 51,187 119,306 170,408 0,18 0,52 0,68 0,188 67,324 170,324 442,1650 1752,3046 2909,3046 1089,0 2416,-1396 2842,-3046 102,0 170,-153 170,-324l-17 -50c68,-86 119,-222 187,-426 68,-221 324,-902 85,-1072l0 0zm874 -13242c9470,0 17148,7677 17148,17147 0,9470 -7678,17148 -17148,17148 -9470,0 -17147,-7678 -17147,-17148 0,-9470 7677,-17147 17147,-17147zm7338 11737c670,0 1213,543 1213,1214 0,670 -543,1213 -1213,1213 -671,0 -1214,-543 -1214,-1213 0,-671 543,-1214 1214,-1214zm0 4086c670,0 1213,544 1213,1214 0,670 -543,1214 -1213,1214 -671,0 -1214,-544 -1214,-1214 0,-670 543,-1214 1214,-1214zm0 3972c670,0 1213,542 1213,1213 0,670 -543,1213 -1213,1213 -671,0 -1214,-543 -1214,-1213 0,-671 543,-1213 1214,-1213zm-3733 -9545l7553 0c520,0 945,425 945,944l0 11337c0,519 -425,944 -945,944l-7553 0c-519,0 -944,-425 -944,-944l0 -11337c0,-519 425,-944 944,-944z"/>
 </g>
</svg>
