{
    "domain": "buy2race.com",
    "client_Id": "QmFzIFAu",
    "secret_key": "2ksCZXQhvL0/Md92dS8xow==",
    "product_key": "3d9706fdfe5fb75a23d332a1d9f276bc",
    "order_time": "30-12-2022",
    "updates_count": "0",
    "max_updates": "4",
    "status": true
}
