%YAML 1.1
%TAG !u! tag:unity3d.com,2011:
--- !u!1045 &1
EditorBuildSettings:
  m_ObjectHideFlags: 0
  serializedVersion: 2
  m_Scenes:
  - enabled: 1
    path: Assets/Scenes/StartMenu.unity
    guid: 96074f9745675c04e8179bdd32bf5ca4
  - enabled: 1
    path: Assets/Scenes/Forest.unity
    guid: 89144d61bd9f3a14eaa439cfb34b5ca2
  m_configObjects: {}
