%YAML 1.1
%TAG !u! tag:unity3d.com,2011:
--- !u!1 &1289612226
GameObject:
  m_ObjectHideFlags: 0
  m_CorrespondingSourceObject: {fileID: 0}
  m_PrefabInstance: {fileID: 0}
  m_PrefabAsset: {fileID: 0}
  serializedVersion: 6
  m_Component:
  - component: {fileID: 1289612227}
  - component: {fileID: 1289612228}
  m_Layer: 9
  m_Name: Circle (1)
  m_TagString: Untagged
  m_Icon: {fileID: 0}
  m_NavMeshLayer: 0
  m_StaticEditorFlags: 0
  m_IsActive: 0
--- !u!4 &1289612227
Transform:
  m_ObjectHideFlags: 0
  m_CorrespondingSourceObject: {fileID: 0}
  m_PrefabInstance: {fileID: 0}
  m_PrefabAsset: {fileID: 0}
  m_GameObject: {fileID: 1289612226}
  m_LocalRotation: {x: 0, y: 0, z: 0, w: 1}
  m_LocalPosition: {x: 0, y: 0, z: 0}
  m_LocalScale: {x: 2.02, y: 2.02, z: 2.02}
  m_ConstrainProportionsScale: 1
  m_Children: []
  m_Father: {fileID: 5763152167533901011}
  m_RootOrder: -1
  m_LocalEulerAnglesHint: {x: 0, y: 0, z: 0}
--- !u!212 &1289612228
SpriteRenderer:
  m_ObjectHideFlags: 0
  m_CorrespondingSourceObject: {fileID: 0}
  m_PrefabInstance: {fileID: 0}
  m_PrefabAsset: {fileID: 0}
  m_GameObject: {fileID: 1289612226}
  m_Enabled: 1
  m_CastShadows: 0
  m_ReceiveShadows: 0
  m_DynamicOccludee: 1
  m_StaticShadowCaster: 0
  m_MotionVectors: 1
  m_LightProbeUsage: 1
  m_ReflectionProbeUsage: 1
  m_RayTracingMode: 0
  m_RayTraceProcedural: 0
  m_RenderingLayerMask: 1
  m_RendererPriority: 0
  m_Materials:
  - {fileID: 10754, guid: 0000000000000000f000000000000000, type: 0}
  m_StaticBatchInfo:
    firstSubMesh: 0
    subMeshCount: 0
  m_StaticBatchRoot: {fileID: 0}
  m_ProbeAnchor: {fileID: 0}
  m_LightProbeVolumeOverride: {fileID: 0}
  m_ScaleInLightmap: 1
  m_ReceiveGI: 1
  m_PreserveUVs: 0
  m_IgnoreNormalsForChartDetection: 0
  m_ImportantGI: 0
  m_StitchLightmapSeams: 1
  m_SelectedEditorRenderState: 0
  m_MinimumChartSize: 4
  m_AutoUVMaxDistance: 0.5
  m_AutoUVMaxAngle: 89
  m_LightmapParameters: {fileID: 0}
  m_SortingLayerID: 0
  m_SortingLayer: 0
  m_SortingOrder: 0
  m_Sprite: {fileID: -2413806693520163455, guid: a86470a33a6bf42c4b3595704624658b, type: 3}
  m_Color: {r: 1, g: 1, b: 1, a: 1}
  m_FlipX: 0
  m_FlipY: 0
  m_DrawMode: 0
  m_Size: {x: 1, y: 1}
  m_AdaptiveModeThreshold: 0.5
  m_SpriteTileMode: 0
  m_WasSpriteAssigned: 1
  m_MaskInteraction: 0
  m_SpriteSortPoint: 0
--- !u!1 &1473903314
GameObject:
  m_ObjectHideFlags: 0
  m_CorrespondingSourceObject: {fileID: 0}
  m_PrefabInstance: {fileID: 0}
  m_PrefabAsset: {fileID: 0}
  serializedVersion: 6
  m_Component:
  - component: {fileID: 1473903315}
  m_Layer: 0
  m_Name: GameObject (1)
  m_TagString: Untagged
  m_Icon: {fileID: 0}
  m_NavMeshLayer: 0
  m_StaticEditorFlags: 0
  m_IsActive: 0
--- !u!4 &1473903315
Transform:
  m_ObjectHideFlags: 0
  m_CorrespondingSourceObject: {fileID: 0}
  m_PrefabInstance: {fileID: 0}
  m_PrefabAsset: {fileID: 0}
  m_GameObject: {fileID: 1473903314}
  m_LocalRotation: {x: -0, y: -0, z: -0, w: 1}
  m_LocalPosition: {x: 0.51, y: 0.84, z: -0.007280301}
  m_LocalScale: {x: 0.5625, y: 0.525, z: 1}
  m_ConstrainProportionsScale: 0
  m_Children:
  - {fileID: 1579365889}
  m_Father: {fileID: 5763152167533901011}
  m_RootOrder: -1
  m_LocalEulerAnglesHint: {x: 0, y: 0, z: 0}
--- !u!1 &1579365888
GameObject:
  m_ObjectHideFlags: 0
  m_CorrespondingSourceObject: {fileID: 0}
  m_PrefabInstance: {fileID: 0}
  m_PrefabAsset: {fileID: 0}
  serializedVersion: 6
  m_Component:
  - component: {fileID: 1579365889}
  - component: {fileID: 1579365890}
  m_Layer: 9
  m_Name: Square
  m_TagString: Untagged
  m_Icon: {fileID: 0}
  m_NavMeshLayer: 0
  m_StaticEditorFlags: 0
  m_IsActive: 1
--- !u!4 &1579365889
Transform:
  m_ObjectHideFlags: 0
  m_CorrespondingSourceObject: {fileID: 0}
  m_PrefabInstance: {fileID: 0}
  m_PrefabAsset: {fileID: 0}
  m_GameObject: {fileID: 1579365888}
  m_LocalRotation: {x: 0, y: 0, z: 0, w: 1}
  m_LocalPosition: {x: -0.163, y: -0.052, z: 0.007280301}
  m_LocalScale: {x: 1, y: 1, z: 1}
  m_ConstrainProportionsScale: 0
  m_Children: []
  m_Father: {fileID: 1473903315}
  m_RootOrder: -1
  m_LocalEulerAnglesHint: {x: 0, y: 0, z: 0}
--- !u!212 &1579365890
SpriteRenderer:
  m_ObjectHideFlags: 0
  m_CorrespondingSourceObject: {fileID: 0}
  m_PrefabInstance: {fileID: 0}
  m_PrefabAsset: {fileID: 0}
  m_GameObject: {fileID: 1579365888}
  m_Enabled: 1
  m_CastShadows: 0
  m_ReceiveShadows: 0
  m_DynamicOccludee: 1
  m_StaticShadowCaster: 0
  m_MotionVectors: 1
  m_LightProbeUsage: 1
  m_ReflectionProbeUsage: 1
  m_RayTracingMode: 0
  m_RayTraceProcedural: 0
  m_RenderingLayerMask: 1
  m_RendererPriority: 0
  m_Materials:
  - {fileID: 2100000, guid: a97c105638bdf8b4a8650670310a4cd3, type: 2}
  m_StaticBatchInfo:
    firstSubMesh: 0
    subMeshCount: 0
  m_StaticBatchRoot: {fileID: 0}
  m_ProbeAnchor: {fileID: 0}
  m_LightProbeVolumeOverride: {fileID: 0}
  m_ScaleInLightmap: 1
  m_ReceiveGI: 1
  m_PreserveUVs: 0
  m_IgnoreNormalsForChartDetection: 0
  m_ImportantGI: 0
  m_StitchLightmapSeams: 1
  m_SelectedEditorRenderState: 0
  m_MinimumChartSize: 4
  m_AutoUVMaxDistance: 0.5
  m_AutoUVMaxAngle: 89
  m_LightmapParameters: {fileID: 0}
  m_SortingLayerID: 0
  m_SortingLayer: 0
  m_SortingOrder: 0
  m_Sprite: {fileID: 7482667652216324306, guid: 311925a002f4447b3a28927169b83ea6, type: 3}
  m_Color: {r: 1, g: 1, b: 1, a: 1}
  m_FlipX: 0
  m_FlipY: 0
  m_DrawMode: 0
  m_Size: {x: 1, y: 1}
  m_AdaptiveModeThreshold: 0.5
  m_SpriteTileMode: 0
  m_WasSpriteAssigned: 1
  m_MaskInteraction: 0
  m_SpriteSortPoint: 0
--- !u!1001 &9024267487929491166
PrefabInstance:
  m_ObjectHideFlags: 0
  serializedVersion: 2
  m_Modification:
    serializedVersion: 2
    m_TransformParent: {fileID: 0}
    m_Modifications:
    - target: {fileID: 3658742774326733322, guid: 34a1869d59275934ea75e9cfac23d4e7, type: 3}
      propertyPath: m_Name
      value: Character
      objectReference: {fileID: 0}
    - target: {fileID: 3658742774326733322, guid: 34a1869d59275934ea75e9cfac23d4e7, type: 3}
      propertyPath: m_TagString
      value: Untagged
      objectReference: {fileID: 0}
    - target: {fileID: 3658742774326733324, guid: 34a1869d59275934ea75e9cfac23d4e7, type: 3}
      propertyPath: _gameState
      value: 
      objectReference: {fileID: 11400000, guid: 439a13e5a0663494ba84459259560077, type: 2}
    - target: {fileID: 3658742774326733325, guid: 34a1869d59275934ea75e9cfac23d4e7, type: 3}
      propertyPath: m_RootOrder
      value: 2
      objectReference: {fileID: 0}
    - target: {fileID: 3658742774326733325, guid: 34a1869d59275934ea75e9cfac23d4e7, type: 3}
      propertyPath: m_LocalPosition.x
      value: 0
      objectReference: {fileID: 0}
    - target: {fileID: 3658742774326733325, guid: 34a1869d59275934ea75e9cfac23d4e7, type: 3}
      propertyPath: m_LocalPosition.y
      value: 0
      objectReference: {fileID: 0}
    - target: {fileID: 3658742774326733325, guid: 34a1869d59275934ea75e9cfac23d4e7, type: 3}
      propertyPath: m_LocalPosition.z
      value: 0
      objectReference: {fileID: 0}
    - target: {fileID: 3658742774326733325, guid: 34a1869d59275934ea75e9cfac23d4e7, type: 3}
      propertyPath: m_LocalRotation.w
      value: 1
      objectReference: {fileID: 0}
    - target: {fileID: 3658742774326733325, guid: 34a1869d59275934ea75e9cfac23d4e7, type: 3}
      propertyPath: m_LocalRotation.x
      value: 0
      objectReference: {fileID: 0}
    - target: {fileID: 3658742774326733325, guid: 34a1869d59275934ea75e9cfac23d4e7, type: 3}
      propertyPath: m_LocalRotation.y
      value: 0
      objectReference: {fileID: 0}
    - target: {fileID: 3658742774326733325, guid: 34a1869d59275934ea75e9cfac23d4e7, type: 3}
      propertyPath: m_LocalRotation.z
      value: 0
      objectReference: {fileID: 0}
    - target: {fileID: 3658742774326733325, guid: 34a1869d59275934ea75e9cfac23d4e7, type: 3}
      propertyPath: m_LocalEulerAnglesHint.x
      value: 0
      objectReference: {fileID: 0}
    - target: {fileID: 3658742774326733325, guid: 34a1869d59275934ea75e9cfac23d4e7, type: 3}
      propertyPath: m_LocalEulerAnglesHint.y
      value: 0
      objectReference: {fileID: 0}
    - target: {fileID: 3658742774326733325, guid: 34a1869d59275934ea75e9cfac23d4e7, type: 3}
      propertyPath: m_LocalEulerAnglesHint.z
      value: 0
      objectReference: {fileID: 0}
    - target: {fileID: 3658742774326733326, guid: 34a1869d59275934ea75e9cfac23d4e7, type: 3}
      propertyPath: m_Enabled
      value: 1
      objectReference: {fileID: 0}
    - target: {fileID: 3658742774326733327, guid: 34a1869d59275934ea75e9cfac23d4e7, type: 3}
      propertyPath: _pState
      value: 
      objectReference: {fileID: 11400000, guid: 5c4f08fec800fa64f927a5267eed72ca, type: 2}
    - target: {fileID: 3658742774326733327, guid: 34a1869d59275934ea75e9cfac23d4e7, type: 3}
      propertyPath: _deathSFX
      value: 
      objectReference: {fileID: 8300000, guid: 34367ff736c7c8a4a92783ae7bc90cd3, type: 3}
    - target: {fileID: 3658742774326733327, guid: 34a1869d59275934ea75e9cfac23d4e7, type: 3}
      propertyPath: _gameState
      value: 
      objectReference: {fileID: 11400000, guid: 439a13e5a0663494ba84459259560077, type: 2}
    - target: {fileID: 3658742774326733327, guid: 34a1869d59275934ea75e9cfac23d4e7, type: 3}
      propertyPath: _sprintSpeed
      value: 7
      objectReference: {fileID: 0}
    - target: {fileID: 3658742774326733327, guid: 34a1869d59275934ea75e9cfac23d4e7, type: 3}
      propertyPath: _flashWaitTime
      value: 2
      objectReference: {fileID: 0}
    - target: {fileID: 3658742774671138548, guid: 34a1869d59275934ea75e9cfac23d4e7, type: 3}
      propertyPath: m_LocalScale.x
      value: 1.2
      objectReference: {fileID: 0}
    - target: {fileID: 3658742774671138548, guid: 34a1869d59275934ea75e9cfac23d4e7, type: 3}
      propertyPath: m_LocalScale.y
      value: 1.2
      objectReference: {fileID: 0}
    - target: {fileID: 3658742774671138548, guid: 34a1869d59275934ea75e9cfac23d4e7, type: 3}
      propertyPath: m_LocalScale.z
      value: 1
      objectReference: {fileID: 0}
    - target: {fileID: 3658742774671138548, guid: 34a1869d59275934ea75e9cfac23d4e7, type: 3}
      propertyPath: m_ConstrainProportionsScale
      value: 0
      objectReference: {fileID: 0}
    - target: {fileID: 3658742774671138549, guid: 34a1869d59275934ea75e9cfac23d4e7, type: 3}
      propertyPath: m_IsActive
      value: 1
      objectReference: {fileID: 0}
    - target: {fileID: 3658742774671138551, guid: 34a1869d59275934ea75e9cfac23d4e7, type: 3}
      propertyPath: m_Size.x
      value: 0.625
      objectReference: {fileID: 0}
    - target: {fileID: 3658742774671138551, guid: 34a1869d59275934ea75e9cfac23d4e7, type: 3}
      propertyPath: m_Size.y
      value: 1
      objectReference: {fileID: 0}
    - target: {fileID: 3658742774671138551, guid: 34a1869d59275934ea75e9cfac23d4e7, type: 3}
      propertyPath: m_Sprite
      value: 
      objectReference: {fileID: -353710600, guid: fc7dcf714a52d9d41acce4dd9facf2b0, type: 3}
    - target: {fileID: 3658742774671138551, guid: 34a1869d59275934ea75e9cfac23d4e7, type: 3}
      propertyPath: m_WasSpriteAssigned
      value: 1
      objectReference: {fileID: 0}
    - target: {fileID: 3658742775389243830, guid: 34a1869d59275934ea75e9cfac23d4e7, type: 3}
      propertyPath: m_IsActive
      value: 1
      objectReference: {fileID: 0}
    - target: {fileID: 3658742775389243848, guid: 34a1869d59275934ea75e9cfac23d4e7, type: 3}
      propertyPath: m_Size.x
      value: 0.625
      objectReference: {fileID: 0}
    - target: {fileID: 3658742775389243848, guid: 34a1869d59275934ea75e9cfac23d4e7, type: 3}
      propertyPath: m_Size.y
      value: 1
      objectReference: {fileID: 0}
    - target: {fileID: 3658742775389243848, guid: 34a1869d59275934ea75e9cfac23d4e7, type: 3}
      propertyPath: m_Sprite
      value: 
      objectReference: {fileID: -353710600, guid: fc7dcf714a52d9d41acce4dd9facf2b0, type: 3}
    - target: {fileID: 3658742775389243848, guid: 34a1869d59275934ea75e9cfac23d4e7, type: 3}
      propertyPath: m_WasSpriteAssigned
      value: 1
      objectReference: {fileID: 0}
    - target: {fileID: 3658742775389243849, guid: 34a1869d59275934ea75e9cfac23d4e7, type: 3}
      propertyPath: m_LocalScale.x
      value: 1.2
      objectReference: {fileID: 0}
    - target: {fileID: 3658742775389243849, guid: 34a1869d59275934ea75e9cfac23d4e7, type: 3}
      propertyPath: m_LocalScale.y
      value: 1.2
      objectReference: {fileID: 0}
    - target: {fileID: 3658742775389243849, guid: 34a1869d59275934ea75e9cfac23d4e7, type: 3}
      propertyPath: m_LocalScale.z
      value: 1
      objectReference: {fileID: 0}
    - target: {fileID: 3658742775389243849, guid: 34a1869d59275934ea75e9cfac23d4e7, type: 3}
      propertyPath: m_ConstrainProportionsScale
      value: 0
      objectReference: {fileID: 0}
    m_RemovedComponents: []
    m_AddedGameObjects:
    - targetCorrespondingSourceObject: {fileID: 3658742774326733325, guid: 34a1869d59275934ea75e9cfac23d4e7, type: 3}
      insertIndex: -1
      addedObject: {fileID: 1473903315}
    - targetCorrespondingSourceObject: {fileID: 3658742774326733325, guid: 34a1869d59275934ea75e9cfac23d4e7, type: 3}
      insertIndex: -1
      addedObject: {fileID: 1289612227}
  m_SourcePrefab: {fileID: 100100000, guid: 34a1869d59275934ea75e9cfac23d4e7, type: 3}
--- !u!4 &5763152167533901011 stripped
Transform:
  m_CorrespondingSourceObject: {fileID: 3658742774326733325, guid: 34a1869d59275934ea75e9cfac23d4e7, type: 3}
  m_PrefabInstance: {fileID: 9024267487929491166}
  m_PrefabAsset: {fileID: 0}
