%YAML 1.1
%TAG !u! tag:unity3d.com,2011:
--- !u!114 &11400000
MonoBehaviour:
  m_ObjectHideFlags: 0
  m_CorrespondingSourceObject: {fileID: 0}
  m_PrefabInstance: {fileID: 0}
  m_PrefabAsset: {fileID: 0}
  m_GameObject: {fileID: 0}
  m_Enabled: 1
  m_EditorHideFlags: 0
  m_Script: {fileID: 11500000, guid: 11145981673336645838492a2d98e247, type: 3}
  m_Name: Renderer2D
  m_EditorClassIdentifier: 
  debugShaders:
    debugReplacementPS: {fileID: 4800000, guid: cf852408f2e174538bcd9b7fda1c5ae7, type: 3}
  m_RendererFeatures:
  - {fileID: 5385220442620533119}
  - {fileID: 6179222929108011096}
  - {fileID: 1742926763475182733}
  m_RendererFeatureMap: 7f9991df7525bc4a58886edd8302c1558da4752ea81e3018
  m_UseNativeRenderPass: 0
  m_TransparencySortMode: 0
  m_TransparencySortAxis: {x: 0, y: 1, z: 0}
  m_HDREmulationScale: 1
  m_LightRenderTextureScale: 0.5
  m_LightBlendStyles:
  - name: Multiply
    maskTextureChannel: 0
    blendMode: 1
  - name: Additive
    maskTextureChannel: 0
    blendMode: 0
  - name: Multiply with Mask
    maskTextureChannel: 1
    blendMode: 1
  - name: Additive with Mask
    maskTextureChannel: 1
    blendMode: 0
  m_UseDepthStencilBuffer: 1
  m_UseCameraSortingLayersTexture: 0
  m_CameraSortingLayersTextureBound: -1
  m_CameraSortingLayerDownsamplingMethod: 0
  m_MaxLightRenderTextureCount: 16
  m_MaxShadowRenderTextureCount: 1
  m_ShapeLightShader: {fileID: 4800000, guid: d79e1c784eaf80c4585c0be7391f757a, type: 3}
  m_ShapeLightVolumeShader: {fileID: 4800000, guid: 7e60080c8cd24a2468cb08b4bfee5606, type: 3}
  m_PointLightShader: {fileID: 4800000, guid: e35a31e1679aeff489e202f5cc4853d5, type: 3}
  m_PointLightVolumeShader: {fileID: 4800000, guid: c7d04ca57e5449d49ad9cee1c604bc26, type: 3}
  m_BlitShader: {fileID: 4800000, guid: c17132b1f77d20942aa75f8429c0f8bc, type: 3}
  m_SamplingShader: {fileID: 4800000, guid: 04c410c9937594faa893a11dceb85f7e, type: 3}
  m_ProjectedShadowShader: {fileID: 4800000, guid: ce09d4a80b88c5a4eb9768fab4f1ee00, type: 3}
  m_SpriteShadowShader: {fileID: 4800000, guid: 44fc62292b65ab04eabcf310e799ccf6, type: 3}
  m_SpriteUnshadowShader: {fileID: 4800000, guid: de02b375720b5c445afe83cd483bedf3, type: 3}
  m_GeometryUnshadowShader: {fileID: 4800000, guid: 77774d9009bb81447b048c907d4c6273, type: 3}
  m_FallbackErrorShader: {fileID: 4800000, guid: e6e9a19c3678ded42a3bc431ebef7dbd, type: 3}
  m_PostProcessData: {fileID: 11400000, guid: 41439944d30ece34e96484bdb6645b55, type: 2}
  m_FallOffLookup: {fileID: 2800000, guid: 5688ab254e4c0634f8d6c8e0792331ca, type: 3}
  m_DefaultMaterialType: 0
  m_DefaultCustomMaterial: {fileID: 2100000, guid: a97c105638bdf8b4a8650670310a4cd3, type: 2}
  m_DefaultLitMaterial: {fileID: 2100000, guid: a97c105638bdf8b4a8650670310a4cd3, type: 2}
  m_DefaultUnlitMaterial: {fileID: 2100000, guid: 9dfc825aed78fcd4ba02077103263b40, type: 2}
  m_DefaultMaskMaterial: {fileID: 2100000, guid: 15d0c3709176029428a0da2f8cecf0b5, type: 2}
--- !u!114 &1742926763475182733
MonoBehaviour:
  m_ObjectHideFlags: 0
  m_CorrespondingSourceObject: {fileID: 0}
  m_PrefabInstance: {fileID: 0}
  m_PrefabAsset: {fileID: 0}
  m_GameObject: {fileID: 0}
  m_Enabled: 1
  m_EditorHideFlags: 0
  m_Script: {fileID: 11500000, guid: 6b3d386ba5cd94485973aee1479b272e, type: 3}
  m_Name: Black
  m_EditorClassIdentifier: 
  m_Active: 1
  settings:
    passTag: Black
    Event: 500
    filterSettings:
      RenderQueueType: 1
      LayerMask:
        serializedVersion: 2
        m_Bits: 512
      PassNames: []
    overrideMaterial: {fileID: 0}
    overrideMaterialPassIndex: 0
    overrideDepthState: 0
    depthCompareFunction: 4
    enableWrite: 1
    stencilSettings:
      overrideStencilState: 1
      stencilReference: 1
      stencilCompareFunction: 6
      passOperation: 0
      failOperation: 0
      zFailOperation: 0
    cameraSettings:
      overrideCamera: 0
      restoreCamera: 1
      offset: {x: 0, y: 0, z: 0, w: 0}
      cameraFieldOfView: 60
--- !u!114 &5385220442620533119
MonoBehaviour:
  m_ObjectHideFlags: 0
  m_CorrespondingSourceObject: {fileID: 0}
  m_PrefabInstance: {fileID: 0}
  m_PrefabAsset: {fileID: 0}
  m_GameObject: {fileID: 0}
  m_Enabled: 1
  m_EditorHideFlags: 0
  m_Script: {fileID: 11500000, guid: 6b3d386ba5cd94485973aee1479b272e, type: 3}
  m_Name: Mask
  m_EditorClassIdentifier: 
  m_Active: 1
  settings:
    passTag: Mask
    Event: 500
    filterSettings:
      RenderQueueType: 1
      LayerMask:
        serializedVersion: 2
        m_Bits: 128
      PassNames: []
    overrideMaterial: {fileID: 0}
    overrideMaterialPassIndex: 0
    overrideDepthState: 0
    depthCompareFunction: 4
    enableWrite: 1
    stencilSettings:
      overrideStencilState: 1
      stencilReference: 1
      stencilCompareFunction: 8
      passOperation: 2
      failOperation: 0
      zFailOperation: 0
    cameraSettings:
      overrideCamera: 0
      restoreCamera: 1
      offset: {x: 0, y: 0, z: 0, w: 0}
      cameraFieldOfView: 60
--- !u!114 &6179222929108011096
MonoBehaviour:
  m_ObjectHideFlags: 0
  m_CorrespondingSourceObject: {fileID: 0}
  m_PrefabInstance: {fileID: 0}
  m_PrefabAsset: {fileID: 0}
  m_GameObject: {fileID: 0}
  m_Enabled: 1
  m_EditorHideFlags: 0
  m_Script: {fileID: 11500000, guid: 6b3d386ba5cd94485973aee1479b272e, type: 3}
  m_Name: BehindMask
  m_EditorClassIdentifier: 
  m_Active: 1
  settings:
    passTag: BehindMask
    Event: 500
    filterSettings:
      RenderQueueType: 1
      LayerMask:
        serializedVersion: 2
        m_Bits: 256
      PassNames: []
    overrideMaterial: {fileID: 0}
    overrideMaterialPassIndex: 0
    overrideDepthState: 0
    depthCompareFunction: 4
    enableWrite: 1
    stencilSettings:
      overrideStencilState: 1
      stencilReference: 1
      stencilCompareFunction: 3
      passOperation: 0
      failOperation: 0
      zFailOperation: 0
    cameraSettings:
      overrideCamera: 0
      restoreCamera: 1
      offset: {x: 0, y: 0, z: 0, w: 0}
      cameraFieldOfView: 60
