{
  "project_info": {
    "project_number": "974367284859",
    "project_id": "cattle-17b1e",
    "storage_bucket": "cattle-17b1e.appspot.com"
  },
  "client": [
    {
      "client_info": {
        "mobilesdk_app_id": "1:974367284859:android:d1a8083f19628da0810cde",
        "android_client_info": {
          "package_name": "com.example.cattle_mall"
        }
      },
      "oauth_client": [
        {
          "client_id": "974367284859-td0jcodnkjrlj1l8i2qmod0f4ltadven.apps.googleusercontent.com",
          "client_type": 1,
          "android_info": {
            "package_name": "com.example.cattle_mall",
            "certificate_hash": "25b8c1a98fffa16b75f6e47b9c2a87aa83097522"
          }
        },
        {
          "client_id": "974367284859-mlbfpt66qejjht21ec9g25cri4tltc5i.apps.googleusercontent.com",
          "client_type": 3
        }
      ],
      "api_key": [
        {
          "current_key": "AIzaSyAgboNFojQTvobzdAPt7TSckqTph0_ijUQ"
        }
      ],
      "services": {
        "appinvite_service": {
          "other_platform_oauth_client": [
            {
              "client_id": "974367284859-mlbfpt66qejjht21ec9g25cri4tltc5i.apps.googleusercontent.com",
              "client_type": 3
            }
          ]
        }
      }
    }
  ],
  "configuration_version": "1"
}