{
  "projectName": "vue3amplify",
  "version": "3.0",
  "frontend": "javascript",
  "javascript": {
    "framework": "vue",
    "config": {
      "SourceDir": "src",
      "DistributionDir": "dist",
      "BuildCommand": "yarn build",
      "StartCommand": " yarn serve"
    }
  },
  "providers": [
    "awscloudformation"
  ]
}