<svg xmlns="http://www.w3.org/2000/svg" xmlns:xlink="http://www.w3.org/1999/xlink" width="130" height="130" viewBox="0 0 130 130">
  <defs>
    <linearGradient id="linear-gradient" x1="0.5" x2="0.5" y2="1" gradientUnits="objectBoundingBox">
      <stop offset="0" stop-color="#e31f25"/>
      <stop offset="1" stop-color="#ff1f26"/>
    </linearGradient>
    <filter id="Area_SIZE:LARGE_STATE:DEFAULT_STYLE:STYLE2_" x="0" y="0" width="130" height="130" filterUnits="userSpaceOnUse">
      <feOffset dy="3" input="SourceAlpha"/>
      <feGaussianBlur stdDeviation="10" result="blur"/>
      <feFlood flood-opacity="0.082"/>
      <feComposite operator="in" in2="blur"/>
      <feComposite in="SourceGraphic"/>
    </filter>
  </defs>
  <g id="Group_634" data-name="Group 634" transform="translate(-1036 -3992)">
    <g transform="matrix(1, 0, 0, 1, 1036, 3992)" filter="url(#Area_SIZE:LARGE_STATE:DEFAULT_STYLE:STYLE2_)">
      <rect id="Area_SIZE:LARGE_STATE:DEFAULT_STYLE:STYLE2_2" data-name="Area [SIZE:LARGE][STATE:DEFAULT][STYLE:STYLE2]" width="70" height="70" rx="35" transform="translate(30 27)" fill="url(#linear-gradient)"/>
    </g>
    <g id="pizza" transform="translate(1079 4031)">
      <path id="Path_181" data-name="Path 181" d="M202.545,366.177a3.278,3.278,0,1,0-3.278,3.278A3.282,3.282,0,0,0,202.545,366.177Zm-5.236,0a1.957,1.957,0,1,1,1.957,1.957A1.96,1.96,0,0,1,197.309,366.177Zm0,0" transform="translate(-178.731 -330.944)" fill="#fff"/>
      <path id="Path_182" data-name="Path 182" d="M106.579,315.758a3.278,3.278,0,1,0,3.278,3.278A3.282,3.282,0,0,0,106.579,315.758Zm0,5.235a1.957,1.957,0,1,1,1.957-1.957A1.96,1.96,0,0,1,106.579,320.993Zm0,0" transform="translate(-94.205 -287.955)" fill="#fff"/>
      <path id="Path_183" data-name="Path 183" d="M131.04,162.625a3.278,3.278,0,1,0,3.278,3.278A3.282,3.282,0,0,0,131.04,162.625Zm0,5.236A1.957,1.957,0,1,1,133,165.9,1.96,1.96,0,0,1,131.04,167.861Zm0,0" transform="translate(-116.512 -148.306)" fill="#fff"/>
      <path id="Path_184" data-name="Path 184" d="M196.74,65.165a3.278,3.278,0,1,0-3.278,3.278A3.282,3.282,0,0,0,196.74,65.165Zm-5.236,0a1.957,1.957,0,1,1,1.957,1.957A1.96,1.96,0,0,1,191.5,65.165Zm0,0" transform="translate(-173.438 -56.437)" fill="#fff"/>
      <path id="Path_185" data-name="Path 185" d="M354.439,115.52a1.969,1.969,0,1,0-1.969,1.969A1.971,1.971,0,0,0,354.439,115.52Zm-2.618,0a.649.649,0,1,1,.649.648A.649.649,0,0,1,351.821,115.52Zm0,0" transform="translate(-319.638 -103.552)" fill="#fff"/>
      <path id="Path_186" data-name="Path 186" d="M304.633,190.75a1.969,1.969,0,1,0,1.969,1.969A1.971,1.971,0,0,0,304.633,190.75Zm0,2.618a.649.649,0,1,1,.649-.649A.649.649,0,0,1,304.633,193.368Zm0,0" transform="translate(-276.014 -173.954)" fill="#fff"/>
      <path id="Path_187" data-name="Path 187" d="M287.2,72.892a1.969,1.969,0,1,0-1.969-1.969A1.971,1.971,0,0,0,287.2,72.892Zm0-2.618a.649.649,0,1,1-.648.649A.649.649,0,0,1,287.2,70.274Zm0,0" transform="translate(-260.112 -62.882)" fill="#fff"/>
      <path id="Path_188" data-name="Path 188" d="M233.164,153.168a1.969,1.969,0,1,0,1.969-1.969A1.972,1.972,0,0,0,233.164,153.168Zm2.618,0a.649.649,0,1,1-.649-.648A.649.649,0,0,1,235.782,153.168Zm0,0" transform="translate(-212.634 -137.886)" fill="#fff"/>
      <path id="Path_189" data-name="Path 189" d="M68.567,196.75a1.969,1.969,0,1,0,1.969,1.969A1.971,1.971,0,0,0,68.567,196.75Zm0,2.618a.649.649,0,1,1,.648-.649A.649.649,0,0,1,68.567,199.368Zm0,0" transform="translate(-60.734 -179.426)" fill="#fff"/>
      <path id="Path_190" data-name="Path 190" d="M153.934,271.2a1.969,1.969,0,1,0-1.969-1.969A1.971,1.971,0,0,0,153.934,271.2Zm0-2.618a.649.649,0,1,1-.649.649A.649.649,0,0,1,153.934,268.583Zm0,0" transform="translate(-138.584 -243.729)" fill="#fff"/>
      <path id="Path_191" data-name="Path 191" d="M120.128,110.411a1.972,1.972,0,1,0-.943-.243A1.972,1.972,0,0,0,120.128,110.411Zm-.179-2.593a.653.653,0,0,1,.183-.026.65.65,0,1,1-.183.026Zm0,0" transform="translate(-107.758 -97.095)" fill="#fff"/>
      <path id="Path_192" data-name="Path 192" d="M75.888,280.2a1.969,1.969,0,1,0-1.969,1.969A1.972,1.972,0,0,0,75.888,280.2Zm-1.969.648a.649.649,0,1,1,.649-.648A.649.649,0,0,1,73.918,280.848Zm0,0" transform="translate(-65.614 -253.732)" fill="#fff"/>
      <path id="Path_193" data-name="Path 193" d="M283.278,396.567a1.969,1.969,0,1,0-1.969-1.969A1.971,1.971,0,0,0,283.278,396.567Zm0-2.617a.648.648,0,1,1-.648.648A.649.649,0,0,1,283.278,393.95Zm0,0" transform="translate(-256.539 -358.057)" fill="#fff"/>
      <path id="Path_194" data-name="Path 194" d="M235.133,311.9a1.969,1.969,0,1,0-1.969-1.969A1.972,1.972,0,0,0,235.133,311.9Zm0-2.618a.649.649,0,1,1-.648.649A.649.649,0,0,1,235.133,309.281Zm0,0" transform="translate(-212.634 -280.844)" fill="#fff"/>
      <path id="Path_195" data-name="Path 195" d="M364.18,164.625a3.278,3.278,0,1,0,3.278,3.278A3.282,3.282,0,0,0,364.18,164.625Zm0,5.236a1.957,1.957,0,1,1,1.957-1.957A1.959,1.959,0,0,1,364.18,169.861Zm0,0" transform="translate(-329.124 -150.129)" fill="#fff"/>
      <path id="Path_196" data-name="Path 196" d="M45,21.1a22.546,22.546,0,0,0-10-17.323,1.974,1.974,0,0,0-1.5-.287,1.97,1.97,0,0,0-.992-1.153,22.581,22.581,0,0,0-20.015,0A1.972,1.972,0,0,0,11.5,3.491a1.975,1.975,0,0,0-1.5.287A22.547,22.547,0,0,0,0,21.1a1.983,1.983,0,0,0,.5,1.441A1.981,1.981,0,0,0,0,23.982,22.546,22.546,0,0,0,10,41.3a1.968,1.968,0,0,0,1.5.287,1.972,1.972,0,0,0,.992,1.153,22.582,22.582,0,0,0,20.014,0,1.979,1.979,0,0,0,.826-2.761L23.643,23.2h7.089v3.748a2.29,2.29,0,0,0,2.334,2.292A2.349,2.349,0,0,0,35.417,26.9v-.606a.387.387,0,1,1,.775,0V31a1.944,1.944,0,0,0,3.887,0V23.2h2.939A1.982,1.982,0,0,0,45,21.1ZM10.966,36.288a20.04,20.04,0,0,1-1.943-2.439,19.851,19.851,0,0,1-2.066-2.335,19.913,19.913,0,0,1-.993-2.955,19.353,19.353,0,0,1-1.138-2.9A10.911,10.911,0,0,1,4.884,23.2H21.356L13.118,37.469A10.714,10.714,0,0,1,10.966,36.288ZM4.826,19.424a19.353,19.353,0,0,1,1.138-2.9,19.926,19.926,0,0,1,.993-2.955,19.823,19.823,0,0,1,2.066-2.335,19.994,19.994,0,0,1,1.943-2.439,10.718,10.718,0,0,1,2.153-1.182l3.475,6.019a.66.66,0,0,0,1.144-.66L14.261,6.951a10.557,10.557,0,0,1,2.1-1.276,20.011,20.011,0,0,1,3.082-.461A19.5,19.5,0,0,1,22.5,4.6a19.492,19.492,0,0,1,3.057.617,20,20,0,0,1,3.082.461,10.57,10.57,0,0,1,2.1,1.276L22.5,21.221l-3.221-5.58a.66.66,0,0,0-1.144.66l3.221,5.58H4.884A10.892,10.892,0,0,1,4.826,19.424Zm8.254-15.9a21.262,21.262,0,0,1,18.84,0,.657.657,0,0,1,.269.917L31.4,5.8a10.6,10.6,0,0,0-2.31-1.371,18.155,18.155,0,0,0-3.306-.521A17.785,17.785,0,0,0,22.5,3.277a17.781,17.781,0,0,0-3.284.636,18.138,18.138,0,0,0-3.306.521A10.593,10.593,0,0,0,13.6,5.8l-.788-1.365h0A.657.657,0,0,1,13.08,3.521ZM1.322,21.183A21.342,21.342,0,0,1,10.738,4.877a.657.657,0,0,1,.93.225l.788,1.365a10.731,10.731,0,0,0-2.34,1.317,18.118,18.118,0,0,0-2.1,2.6,17.968,17.968,0,0,0-2.2,2.523,18.044,18.044,0,0,0-1.09,3.164,17.66,17.66,0,0,0-1.2,3.125,10.86,10.86,0,0,0,.035,2.685H1.981A.659.659,0,0,1,1.322,21.183Zm9.416,19.022A21.341,21.341,0,0,1,1.322,23.9a.659.659,0,0,1,.66-.7H3.56a10.861,10.861,0,0,0-.035,2.685,17.65,17.65,0,0,0,1.2,3.125,18.082,18.082,0,0,0,1.09,3.164,18.012,18.012,0,0,0,2.2,2.523,18.1,18.1,0,0,0,2.1,2.6,10.711,10.711,0,0,0,2.34,1.317l-.788,1.365A.656.656,0,0,1,10.738,40.206ZM31.92,41.561a21.262,21.262,0,0,1-18.84,0,.657.657,0,0,1-.269-.917l.789-1.366a10.6,10.6,0,0,0,2.31,1.371.66.66,0,0,0,.452-1.241,10.547,10.547,0,0,1-2.1-1.277L22.5,23.862l8.238,14.269a10.556,10.556,0,0,1-2.1,1.277,20.053,20.053,0,0,1-3.082.461,19.532,19.532,0,0,1-3.057.617,27.245,27.245,0,0,1-3.306-.657A.66.66,0,1,0,19,41.136a22.643,22.643,0,0,0,3.5.67,17.762,17.762,0,0,0,3.284-.636,18.117,18.117,0,0,0,3.306-.521,10.58,10.58,0,0,0,2.31-1.371l.789,1.366A.657.657,0,0,1,31.92,41.561Zm7.5-19.68a.661.661,0,0,0-.66.66V31a.623.623,0,1,1-1.245,0V26.294a1.708,1.708,0,0,0-3.416,0V26.9a1.028,1.028,0,0,1-1.072,1.022.971.971,0,0,1-.971-.971V23.2h4.994a.66.66,0,0,0,0-1.321h-13.4L31.881,7.613a10.7,10.7,0,0,1,2.153,1.181,20.014,20.014,0,0,1,1.943,2.439,19.823,19.823,0,0,1,2.066,2.335,19.953,19.953,0,0,1,.993,2.955,19.39,19.39,0,0,1,1.138,2.9,10.892,10.892,0,0,1-.058,2.457Zm3.6,0H41.439a10.86,10.86,0,0,0,.035-2.685,17.65,17.65,0,0,0-1.2-3.125,18.054,18.054,0,0,0-1.09-3.164,17.976,17.976,0,0,0-2.2-2.523,18.09,18.09,0,0,0-2.1-2.6,10.734,10.734,0,0,0-2.34-1.317L33.331,5.1a.657.657,0,0,1,.93-.225,21.342,21.342,0,0,1,9.416,16.307A.659.659,0,0,1,43.017,21.881Zm0,0" transform="translate(0)" fill="#fff"/>
    </g>
  </g>
</svg>
