<svg xmlns="http://www.w3.org/2000/svg" xmlns:xlink="http://www.w3.org/1999/xlink" width="150" height="150" viewBox="0 0 150 150">
  <defs>
    <linearGradient id="linear-gradient" x1="0.5" x2="0.5" y2="1" gradientUnits="objectBoundingBox">
      <stop offset="0" stop-color="#e31f25"/>
      <stop offset="1" stop-color="#ff1f26"/>
    </linearGradient>
    <filter id="Area_SIZE:LARGE_STATE:DEFAULT_STYLE:STYLE2_" x="0" y="0" width="150" height="150" filterUnits="userSpaceOnUse">
      <feOffset dy="3" input="SourceAlpha"/>
      <feGaussianBlur stdDeviation="10" result="blur"/>
      <feFlood flood-opacity="0.082"/>
      <feComposite operator="in" in2="blur"/>
      <feComposite in="SourceGraphic"/>
    </filter>
  </defs>
  <g id="Group_551" data-name="Group 551" transform="translate(-1480 -4089)">
    <g id="Circle_Button_" data-name="Circle Button " transform="translate(1510.16 4116.179)">
      <g transform="matrix(1, 0, 0, 1, -30.16, -27.18)" filter="url(#Area_SIZE:LARGE_STATE:DEFAULT_STYLE:STYLE2_)">
        <rect id="Area_SIZE:LARGE_STATE:DEFAULT_STYLE:STYLE2_2" data-name="Area [SIZE:LARGE][STATE:DEFAULT][STYLE:STYLE2]" width="90" height="90" rx="45" transform="translate(30 27)" fill="url(#linear-gradient)"/>
      </g>
      <g id="Icon_" data-name="Icon " transform="translate(30.34 30.321)">
        <rect id="Area_ICON:feather_heart_SIZE:LARGE_STATE:DEFAULT_STYLE:STYLE2_" data-name="Area [ICON:feather/heart][SIZE:LARGE][STATE:DEFAULT][STYLE:STYLE2]" width="29" height="29" fill="rgba(253,73,198,0.35)" opacity="0"/>
      </g>
    </g>
    <g id="Page-1" transform="translate(1530 4136.015)">
      <g id="_026---Synthetic-Fabric" data-name="026---Synthetic-Fabric" transform="translate(0 -0.014)">
        <path id="Shape" d="M47.294,39.177a3.083,3.083,0,0,0-.846-3.348,1.467,1.467,0,0,1,0-2.274,3.113,3.113,0,0,0,.005-4.65,1.466,1.466,0,0,1-.01-2.269,3.213,3.213,0,0,0,1.051-2.328,3.249,3.249,0,0,0-1.046-2.333,1.6,1.6,0,0,1-.537-1.125,1.635,1.635,0,0,1,.532-1.13,3.123,3.123,0,0,0,.005-4.666,1.459,1.459,0,0,1-.005-2.258,3.113,3.113,0,0,0,.005-4.66A1.63,1.63,0,0,1,45.906,7a1.6,1.6,0,0,1,.533-1.131,3.125,3.125,0,0,0,.855-3.388,2.249,2.249,0,0,0-1.333-1.313,3.217,3.217,0,0,0-3.421.833,1.646,1.646,0,0,1-1.174.528A1.631,1.631,0,0,1,40.2,2a3.3,3.3,0,0,0-4.7,0,1.61,1.61,0,0,1-2.349,0,3.3,3.3,0,0,0-4.707,0A1.593,1.593,0,0,1,26.1,2,3.3,3.3,0,0,0,21.4,2a1.588,1.588,0,0,1-2.35,0,3.3,3.3,0,0,0-4.7,0A1.608,1.608,0,0,1,12,2.007a3.3,3.3,0,0,0-4.707,0,1.593,1.593,0,0,1-2.343,0,3.194,3.194,0,0,0-3.393-.842A2.244,2.244,0,0,0,.195,2.487a3.1,3.1,0,0,0,.853,3.385A1.57,1.57,0,0,1,1.583,7a1.568,1.568,0,0,1-.528,1.13,3.113,3.113,0,0,0,0,4.66,1.608,1.608,0,0,1,.533,1.134,1.6,1.6,0,0,1-.538,1.126A3.249,3.249,0,0,0,0,17.385a3.215,3.215,0,0,0,1.041,2.327,1.642,1.642,0,0,1,.542,1.139,1.6,1.6,0,0,1-.537,1.126A3.249,3.249,0,0,0,0,24.309a3.206,3.206,0,0,0,1.041,2.319,1.637,1.637,0,0,1,.542,1.139A1.642,1.642,0,0,1,1.046,28.9a3.113,3.113,0,0,0,0,4.65,1.615,1.615,0,0,1,.542,1.139,1.606,1.606,0,0,1-.532,1.133A3.215,3.215,0,0,0,0,38.147a3.268,3.268,0,0,0,1.051,2.345,1.57,1.57,0,0,1,.532,1.121,1.625,1.625,0,0,1-.529,1.125,3.113,3.113,0,0,0-.928,3.178,2.353,2.353,0,0,0,1.723,1.666,2.684,2.684,0,0,0,.615.072,3.89,3.89,0,0,0,2.416-.971,1.732,1.732,0,0,1,2.42-.057,3.293,3.293,0,0,0,4.7-.01,1.591,1.591,0,0,1,2.348,0c.036.036.077.068.116.1a6.042,6.042,0,0,0,5.815,4.267H43.87A6.1,6.1,0,0,0,48.814,41.3ZM10.817,45.439a1.595,1.595,0,0,1-2.341,0,3.309,3.309,0,0,0-4.636-.069,2.035,2.035,0,0,1-1.625.583.709.709,0,0,1-.49-.51,1.47,1.47,0,0,1,.484-1.505,3.279,3.279,0,0,0,1.041-2.33A3.212,3.212,0,0,0,2.2,39.29a1.466,1.466,0,0,1,0-2.274,3.279,3.279,0,0,0,1.045-2.327A3.287,3.287,0,0,0,2.2,32.357a1.457,1.457,0,0,1,0-2.265,3.237,3.237,0,0,0,1.045-2.325A3.292,3.292,0,0,0,2.2,25.433a1.554,1.554,0,0,1-.533-1.125A1.583,1.583,0,0,1,2.2,23.175a3.249,3.249,0,0,0,1.045-2.324A3.249,3.249,0,0,0,2.2,18.518a1.464,1.464,0,0,1,0-2.264,3.243,3.243,0,0,0,1.045-2.327A3.257,3.257,0,0,0,2.2,11.6a1.583,1.583,0,0,1-.533-1.133A1.557,1.557,0,0,1,2.2,9.338,3.238,3.238,0,0,0,3.249,7,3.236,3.236,0,0,0,2.208,4.672a1.463,1.463,0,0,1-.45-1.6.592.592,0,0,1,.362-.338,1.542,1.542,0,0,1,1.656.447,3.3,3.3,0,0,0,4.7,0,1.583,1.583,0,0,1,2.346,0,3.3,3.3,0,0,0,4.716,0,1.583,1.583,0,0,1,2.341,0,3.293,3.293,0,0,0,4.707,0,1.565,1.565,0,0,1,2.338.009,3.3,3.3,0,0,0,4.7,0,1.576,1.576,0,0,1,2.351,0,3.3,3.3,0,0,0,4.71-.009,1.59,1.59,0,0,1,2.337,0A3.3,3.3,0,0,0,41.36,4.2h.006a3.318,3.318,0,0,0,2.357-1.022A1.538,1.538,0,0,1,45.4,2.742a.593.593,0,0,1,.333.333,1.455,1.455,0,0,1-.451,1.6A3.249,3.249,0,0,0,44.239,7a3.257,3.257,0,0,0,1.05,2.333,1.554,1.554,0,0,1,.533,1.125,1.583,1.583,0,0,1-.538,1.134,3.114,3.114,0,0,0,0,4.655,1.466,1.466,0,0,1,0,2.274,3.113,3.113,0,0,0,0,4.65,1.59,1.59,0,0,1,.538,1.135,1.565,1.565,0,0,1-.542,1.131,3.283,3.283,0,0,0-1.041,2.327A3.241,3.241,0,0,0,45.284,30.1a1.457,1.457,0,0,1,0,2.265,3.283,3.283,0,0,0-1.041,2.325c0,.083.02.167.027.256L39,27.583a3.326,3.326,0,0,1-.638-1.962V14.994a2.5,2.5,0,0,0,1.629-2.333v-.833a2.5,2.5,0,0,0-2.5-2.5H26.66a2.5,2.5,0,0,0-2.5,2.5v.833a2.5,2.5,0,0,0,1.666,2.346V25.621a3.333,3.333,0,0,1-.64,1.965L15.341,41.295a6.074,6.074,0,0,0-1.156,3.333,3.288,3.288,0,0,0-3.368.812ZM38.324,12.661a.833.833,0,0,1-.833.833H26.66a.833.833,0,0,1-.833-.833v-.833A.833.833,0,0,1,26.66,11H37.491a.833.833,0,0,1,.833.833ZM27.493,25.621V15.161h9.2v10.46a4.975,4.975,0,0,0,.951,2.935l2.721,3.8a11.673,11.673,0,0,1-9.071.173,16.02,16.02,0,0,0-6.915-.973l2.154-3a4.988,4.988,0,0,0,.957-2.94ZM47.83,46.893a4.366,4.366,0,0,1-3.96,2.426H20.281a4.435,4.435,0,0,1-3.589-7.047l6.36-8.856a14.289,14.289,0,0,1,7.665.68,14.313,14.313,0,0,0,5,.936,12.974,12.974,0,0,0,5.633-1.291l4.289,6c.011.016.021.03.032.045l1.786,2.5a4.354,4.354,0,0,1,.369,4.611Z" transform="translate(0 -0.986)" fill="#fff"/>
        <path id="Shape-2" data-name="Shape" d="M36.5,50A2.5,2.5,0,1,0,39,52.5,2.5,2.5,0,0,0,36.5,50Zm0,3.333a.833.833,0,1,1,.833-.833A.833.833,0,0,1,36.5,53.333Z" transform="translate(-5.673 -9.165)" fill="#fff"/>
        <path id="Shape-3" data-name="Shape" d="M29.5,43A2.5,2.5,0,1,0,32,45.5,2.5,2.5,0,0,0,29.5,43Zm0,3.333a.833.833,0,1,1,.833-.833A.833.833,0,0,1,29.5,46.333Z" transform="translate(-4.505 -7.997)" fill="#fff"/>
        <path id="Shape-4" data-name="Shape" d="M49.5,47A2.5,2.5,0,1,0,52,49.5,2.5,2.5,0,0,0,49.5,47Zm0,3.333a.833.833,0,1,1,.833-.833A.833.833,0,0,1,49.5,50.333Z" transform="translate(-7.843 -8.664)" fill="#fff"/>
        <circle id="Oval" cx="0.833" cy="0.833" r="0.833" transform="translate(32.492 37.503)" fill="#fff"/>
        <circle id="Oval-2" data-name="Oval" cx="0.833" cy="0.833" r="0.833" transform="translate(21.661 42.502)" fill="#fff"/>
        <circle id="Oval-3" data-name="Oval" cx="0.833" cy="0.833" r="0.833" transform="translate(37.491 44.168)" fill="#fff"/>
        <path id="Shape-5" data-name="Shape" d="M10.833,10.5a.833.833,0,0,0,.833-.833V8.833a.833.833,0,1,0-1.666,0v.833A.833.833,0,0,0,10.833,10.5Z" transform="translate(-1.669 -2.156)" fill="#fff"/>
        <path id="Shape-6" data-name="Shape" d="M7.833,12.666h.833a.833.833,0,0,0,0-1.666H7.833a.833.833,0,1,0,0,1.666Z" transform="translate(-1.168 -2.657)" fill="#fff"/>
        <path id="Shape-7" data-name="Shape" d="M12.833,12.666h.833a.833.833,0,1,0,0-1.666h-.833a.833.833,0,0,0,0,1.666Z" transform="translate(-2.002 -2.657)" fill="#fff"/>
        <path id="Shape-8" data-name="Shape" d="M10.833,15.5a.833.833,0,0,0,.833-.833v-.833a.833.833,0,0,0-1.666,0v.833A.833.833,0,0,0,10.833,15.5Z" transform="translate(-1.669 -2.99)" fill="#fff"/>
        <path id="Shape-9" data-name="Shape" d="M16.833,18.5a.833.833,0,0,0,.833-.833v-.833a.833.833,0,0,0-1.666,0v.833A.833.833,0,0,0,16.833,18.5Z" transform="translate(-2.67 -3.491)" fill="#fff"/>
        <path id="Shape-10" data-name="Shape" d="M13.833,19a.833.833,0,0,0,0,1.666h.833a.833.833,0,1,0,0-1.666Z" transform="translate(-2.169 -3.992)" fill="#fff"/>
        <path id="Shape-11" data-name="Shape" d="M18.833,20.666h.833a.833.833,0,0,0,0-1.666h-.833a.833.833,0,0,0,0,1.666Z" transform="translate(-3.004 -3.992)" fill="#fff"/>
        <path id="Shape-12" data-name="Shape" d="M16.833,23.5a.833.833,0,0,0,.833-.833v-.833a.833.833,0,0,0-1.666,0v.833A.833.833,0,0,0,16.833,23.5Z" transform="translate(-2.67 -4.325)" fill="#fff"/>
        <path id="Shape-13" data-name="Shape" d="M22.833,10.5a.833.833,0,0,0,.833-.833V8.833a.833.833,0,1,0-1.666,0v.833A.833.833,0,0,0,22.833,10.5Z" transform="translate(-3.671 -2.156)" fill="#fff"/>
        <path id="Shape-14" data-name="Shape" d="M19.833,12.666h.833a.833.833,0,0,0,0-1.666h-.833a.833.833,0,0,0,0,1.666Z" transform="translate(-3.17 -2.657)" fill="#fff"/>
        <path id="Shape-15" data-name="Shape" d="M24.833,12.666h.833a.833.833,0,0,0,0-1.666h-.833a.833.833,0,0,0,0,1.666Z" transform="translate(-4.005 -2.657)" fill="#fff"/>
        <path id="Shape-16" data-name="Shape" d="M22.833,15.5a.833.833,0,0,0,.833-.833v-.833a.833.833,0,0,0-1.666,0v.833A.833.833,0,0,0,22.833,15.5Z" transform="translate(-3.671 -2.99)" fill="#fff"/>
        <path id="Shape-17" data-name="Shape" d="M11.666,25.833a.833.833,0,1,0-1.666,0v.833a.833.833,0,0,0,1.666,0Z" transform="translate(-1.669 -4.993)" fill="#fff"/>
        <path id="Shape-18" data-name="Shape" d="M7.833,29.666h.833a.833.833,0,0,0,0-1.666H7.833a.833.833,0,1,0,0,1.666Z" transform="translate(-1.168 -5.494)" fill="#fff"/>
        <path id="Shape-19" data-name="Shape" d="M12.833,29.666h.833a.833.833,0,1,0,0-1.666h-.833a.833.833,0,1,0,0,1.666Z" transform="translate(-2.002 -5.494)" fill="#fff"/>
        <path id="Shape-20" data-name="Shape" d="M11.666,30.833a.833.833,0,1,0-1.666,0v.833a.833.833,0,0,0,1.666,0Z" transform="translate(-1.669 -5.827)" fill="#fff"/>
        <path id="Shape-21" data-name="Shape" d="M10.833,42a.833.833,0,0,0-.833.833v.833a.833.833,0,1,0,1.666,0v-.833A.833.833,0,0,0,10.833,42Z" transform="translate(-1.669 -7.83)" fill="#fff"/>
        <path id="Shape-22" data-name="Shape" d="M8.666,45H7.833a.833.833,0,0,0,0,1.666h.833a.833.833,0,0,0,0-1.666Z" transform="translate(-1.168 -8.33)" fill="#fff"/>
        <path id="Shape-23" data-name="Shape" d="M13.666,45h-.833a.833.833,0,0,0,0,1.666h.833a.833.833,0,0,0,0-1.666Z" transform="translate(-2.002 -8.33)" fill="#fff"/>
        <path id="Shape-24" data-name="Shape" d="M10.833,47a.833.833,0,0,0-.833.833v.833a.833.833,0,1,0,1.666,0v-.833A.833.833,0,0,0,10.833,47Z" transform="translate(-1.669 -8.664)" fill="#fff"/>
        <path id="Shape-25" data-name="Shape" d="M16,35.666a.833.833,0,1,0,1.666,0v-.833a.833.833,0,0,0-1.666,0Z" transform="translate(-2.67 -6.495)" fill="#fff"/>
        <path id="Shape-26" data-name="Shape" d="M14.666,37h-.833a.833.833,0,1,0,0,1.666h.833a.833.833,0,1,0,0-1.666Z" transform="translate(-2.169 -6.995)" fill="#fff"/>
        <path id="Shape-27" data-name="Shape" d="M19.666,37h-.833a.833.833,0,0,0,0,1.666h.833a.833.833,0,1,0,0-1.666Z" transform="translate(-3.004 -6.995)" fill="#fff"/>
        <path id="Shape-28" data-name="Shape" d="M17.666,40.666v-.833a.833.833,0,0,0-1.666,0v.833a.833.833,0,1,0,1.666,0Z" transform="translate(-2.67 -7.329)" fill="#fff"/>
        <path id="Shape-29" data-name="Shape" d="M22,26.666a.833.833,0,0,0,1.666,0v-.833a.833.833,0,1,0-1.666,0Z" transform="translate(-3.671 -4.993)" fill="#fff"/>
        <path id="Shape-30" data-name="Shape" d="M20.666,28h-.833a.833.833,0,0,0,0,1.666h.833a.833.833,0,0,0,0-1.666Z" transform="translate(-3.17 -5.494)" fill="#fff"/>
        <path id="Shape-31" data-name="Shape" d="M25.666,28h-.833a.833.833,0,0,0,0,1.666h.833a.833.833,0,0,0,0-1.666Z" transform="translate(-4.005 -5.494)" fill="#fff"/>
        <path id="Shape-32" data-name="Shape" d="M22.833,30a.833.833,0,0,0-.833.833v.833a.833.833,0,0,0,1.666,0v-.833A.833.833,0,0,0,22.833,30Z" transform="translate(-3.671 -5.827)" fill="#fff"/>
      </g>
    </g>
  </g>
</svg>
