<svg xmlns="http://www.w3.org/2000/svg" xmlns:xlink="http://www.w3.org/1999/xlink" width="116" height="116" viewBox="0 0 116 116">
  <defs>
    <linearGradient id="linear-gradient" x1="0.5" x2="0.5" y2="1" gradientUnits="objectBoundingBox">
      <stop offset="0" stop-color="#e31f25"/>
      <stop offset="1" stop-color="#e31f25"/>
    </linearGradient>
    <filter id="Area_SIZE:LARGE_STATE:DEFAULT_STYLE:STYLE2_" x="0" y="0" width="116" height="116" filterUnits="userSpaceOnUse">
      <feOffset dy="10" input="SourceAlpha"/>
      <feGaussianBlur stdDeviation="6" result="blur"/>
      <feFlood flood-opacity="0.22"/>
      <feComposite operator="in" in2="blur"/>
      <feComposite in="SourceGraphic"/>
    </filter>
  </defs>
  <g id="Circle_Button_" data-name="Circle Button " transform="translate(17.629 18.178)">
    <g transform="matrix(1, 0, 0, 1, -17.63, -18.18)" filter="url(#Area_SIZE:LARGE_STATE:DEFAULT_STYLE:STYLE2_)">
      <rect id="Area_SIZE:LARGE_STATE:DEFAULT_STYLE:STYLE2_2" data-name="Area [SIZE:LARGE][STATE:DEFAULT][STYLE:STYLE2]" width="80" height="80" rx="40" transform="translate(18 8)" fill="url(#linear-gradient)"/>
    </g>
    <g id="moisturizing" transform="translate(16.371 -8.729)">
      <g id="Group_472" data-name="Group 472" transform="translate(0 15.017)">
        <path id="Path_136" data-name="Path 136" d="M65.479,27.042a.968.968,0,0,0,1.43,0l2.8-3.147a.957.957,0,1,0-1.43-1.273l-1.13,1.269V15.974a.957.957,0,0,0-1.914,0v7.917l-1.13-1.269a.957.957,0,0,0-1.43,1.273Z" transform="translate(-56.46 -15.017)" fill="#fff"/>
        <path id="Path_137" data-name="Path 137" d="M374.3,27.042a.968.968,0,0,0,1.43,0l2.8-3.147a.957.957,0,1,0-1.43-1.273l-1.13,1.269V15.974a.957.957,0,0,0-1.914,0v7.917l-1.13-1.269a.957.957,0,0,0-1.43,1.273Z" transform="translate(-335.729 -15.017)" fill="#fff"/>
        <path id="Path_138" data-name="Path 138" d="M48.043,52H34.187a9.5,9.5,0,0,0-1.355-5.236l-.961-1.56a.957.957,0,1,0-1.629,1l.951,1.544a7.8,7.8,0,0,1-6.724,11.773,7.891,7.891,0,0,1-7.8-7.868,8.256,8.256,0,0,1,1.123-3.972L24.17,37.344a.355.355,0,0,1,.6,0L25.857,39.1a.957.957,0,1,0,1.629-1L26.4,36.339a2.254,2.254,0,0,0-1.931-1.078h0a2.255,2.255,0,0,0-1.932,1.078l-6.4,10.38a9.625,9.625,0,0,0-1.384,4.923c0,.12,0,.239,0,.358H.957A.957.957,0,0,0,0,52.958v23.8a.966.966,0,0,0,1.2.925,6.283,6.283,0,0,1,4.789.649,8.17,8.17,0,0,0,8.194,0,6.354,6.354,0,0,1,6.35,0,8.319,8.319,0,0,0,8.282,0,6.371,6.371,0,0,1,6.358,0,8.26,8.26,0,0,0,8.282,0,6.744,6.744,0,0,1,4.414-.753A.966.966,0,0,0,49,76.642V52.958A.957.957,0,0,0,48.043,52Zm-.957,1.914v3.621a8.383,8.383,0,0,0-4.56,1.12,6.427,6.427,0,0,1-6.452,0,8.357,8.357,0,0,0-3.815-1.116,9.6,9.6,0,0,0,1.685-3.625H47.086Zm-45.172,0H15a9.749,9.749,0,0,0,1.687,3.624,9.185,9.185,0,0,0-4.009,1.22,6.515,6.515,0,0,1-6.266-.1,8.38,8.38,0,0,0-4.188-1.129q-.156,0-.313.006V53.915ZM42.495,76.681a6.339,6.339,0,0,1-6.352,0,8.329,8.329,0,0,0-8.287,0,6.424,6.424,0,0,1-6.359,0,8.291,8.291,0,0,0-8.282,0,6.247,6.247,0,0,1-6.263,0,8.174,8.174,0,0,0-5.038-1.069V59.45a7.138,7.138,0,0,1,3.793,1,8.346,8.346,0,0,0,8.122-.142,6.487,6.487,0,0,1,5.155-.568,9.783,9.783,0,0,0,10.984,0c2.06-.637,3.788-.08,5.635.835a8.409,8.409,0,0,0,7.394,0,7.846,7.846,0,0,1,4.089-1.121V75.576A8.607,8.607,0,0,0,42.495,76.681Z" transform="translate(0 -33.324)" fill="#fff"/>
        <path id="Path_139" data-name="Path 139" d="M74.466,324.351a3.059,3.059,0,1,0,3.059,3.059A3.063,3.063,0,0,0,74.466,324.351Zm0,4.2a1.145,1.145,0,1,1,1.145-1.145A1.146,1.146,0,0,1,74.466,328.555Z" transform="translate(-64.573 -294.747)" fill="#fff"/>
        <path id="Path_140" data-name="Path 140" d="M382.114,324.351a3.059,3.059,0,1,0,3.059,3.059A3.063,3.063,0,0,0,382.114,324.351Zm0,4.2a1.145,1.145,0,1,1,1.145-1.145A1.146,1.146,0,0,1,382.114,328.555Z" transform="translate(-342.778 -294.747)" fill="#fff"/>
        <path id="Path_141" data-name="Path 141" d="M229.014,381.281a3.059,3.059,0,1,0,3.059,3.059A3.063,3.063,0,0,0,229.014,381.281Zm0,4.2a1.145,1.145,0,1,1,1.145-1.145A1.146,1.146,0,0,1,229.014,385.485Z" transform="translate(-204.33 -346.228)" fill="#fff"/>
        <path id="Path_142" data-name="Path 142" d="M248.016,332.071a.956.956,0,1,0,.518-1.25.965.965,0,0,0-.518,1.25Z" transform="translate(-224.215 -300.533)" fill="#fff"/>
        <path id="Path_143" data-name="Path 143" d="M402.4,422.636a.956.956,0,1,0-.518,1.249A.965.965,0,0,0,402.4,422.636Z" transform="translate(-362.224 -383.093)" fill="#fff"/>
        <path id="Path_144" data-name="Path 144" d="M93.574,422.635a.956.956,0,1,0-.518,1.25A.966.966,0,0,0,93.574,422.635Z" transform="translate(-82.957 -383.093)" fill="#fff"/>
        <path id="Path_145" data-name="Path 145" d="M290.893,97.312a.957.957,0,1,0,.518-1.25A.966.966,0,0,0,290.893,97.312Z" transform="translate(-262.99 -88.241)" fill="#fff"/>
      </g>
    </g>
  </g>
</svg>
