<svg xmlns="http://www.w3.org/2000/svg" xmlns:xlink="http://www.w3.org/1999/xlink" width="130" height="130" viewBox="0 0 130 130">
  <defs>
    <linearGradient id="linear-gradient" x1="0.5" x2="0.5" y2="1" gradientUnits="objectBoundingBox">
      <stop offset="0" stop-color="#e31f25"/>
      <stop offset="1" stop-color="#ff1f26"/>
    </linearGradient>
    <filter id="Area_SIZE:LARGE_STATE:DEFAULT_STYLE:STYLE2_" x="0" y="0" width="130" height="130" filterUnits="userSpaceOnUse">
      <feOffset dy="3" input="SourceAlpha"/>
      <feGaussianBlur stdDeviation="10" result="blur"/>
      <feFlood flood-opacity="0.082"/>
      <feComposite operator="in" in2="blur"/>
      <feComposite in="SourceGraphic"/>
    </filter>
  </defs>
  <g id="Circle_Button_" data-name="Circle Button " transform="translate(30.097 27.178)">
    <g transform="matrix(1, 0, 0, 1, -30.1, -27.18)" filter="url(#Area_SIZE:LARGE_STATE:DEFAULT_STYLE:STYLE2_)">
      <rect id="Area_SIZE:LARGE_STATE:DEFAULT_STYLE:STYLE2_2" data-name="Area [SIZE:LARGE][STATE:DEFAULT][STYLE:STYLE2]" width="70" height="70" rx="35" transform="translate(30 27)" fill="url(#linear-gradient)"/>
    </g>
    <g id="improvement" transform="translate(12.402 -32.716)">
      <path id="Path_236" data-name="Path 236" d="M45,52.166v8.656H42.95V55.567L20.69,77.827,13.6,70.733,1.45,82.879,0,81.43l13.6-13.6,7.094,7.094L41.4,54.216H36.344v-2.05ZM14.1,74.226,6.872,81.458l1.45,1.45,7.232-7.232ZM40.758,62.275,21.575,81.458l1.45,1.449L42.208,63.725ZM29.136,81.459l1.45,1.45L44.7,68.792l-1.45-1.45Zm7.558,0,1.45,1.45,6.34-6.34-1.449-1.45Zm-22.348-.028,1.45,1.45,3.2-3.2-1.45-1.45Z" fill="#fff"/>
    </g>
  </g>
</svg>
