<svg xmlns="http://www.w3.org/2000/svg" xmlns:xlink="http://www.w3.org/1999/xlink" width="130" height="130" viewBox="0 0 130 130">
  <defs>
    <linearGradient id="linear-gradient" x1="0.5" x2="0.5" y2="1" gradientUnits="objectBoundingBox">
      <stop offset="0" stop-color="#e31f25"/>
      <stop offset="1" stop-color="#ff1f26"/>
    </linearGradient>
    <filter id="Area_SIZE:LARGE_STATE:DEFAULT_STYLE:STYLE2_" x="0" y="0" width="130" height="130" filterUnits="userSpaceOnUse">
      <feOffset dy="3" input="SourceAlpha"/>
      <feGaussianBlur stdDeviation="10" result="blur"/>
      <feFlood flood-opacity="0.082"/>
      <feComposite operator="in" in2="blur"/>
      <feComposite in="SourceGraphic"/>
    </filter>
  </defs>
  <g id="Group_629" data-name="Group 629" transform="translate(-1555 -1977)">
    <g id="Circle_Button_" data-name="Circle Button " transform="translate(1585.098 2004.179)">
      <g transform="matrix(1, 0, 0, 1, -30.1, -27.18)" filter="url(#Area_SIZE:LARGE_STATE:DEFAULT_STYLE:STYLE2_)">
        <rect id="Area_SIZE:LARGE_STATE:DEFAULT_STYLE:STYLE2_2" data-name="Area [SIZE:LARGE][STATE:DEFAULT][STYLE:STYLE2]" width="70" height="70" rx="35" transform="translate(30 27)" fill="url(#linear-gradient)"/>
      </g>
    </g>
    <g id="dust" transform="translate(1581.75 2000.75)">
      <path id="Path_202" data-name="Path 202" d="M60.425,71.356H40.741L55.808,56.291v2.3a.825.825,0,0,0,1.649,0V54.3a.824.824,0,0,0-.825-.825H52.344a.825.825,0,0,0,0,1.649h2.3L38.75,71.016l-17.3-17.3a.825.825,0,1,0-1.166,1.166L36.759,71.356H17.075a.825.825,0,0,0-.825.825v2.93a.825.825,0,0,0,.825.825H60.425a.825.825,0,0,0,.825-.825v-2.93a.825.825,0,0,0-.825-.825ZM59.6,73.006v1.281H17.9V73.006Z" transform="translate(0 -19.685)" fill="#fff"/>
      <path id="Path_203" data-name="Path 203" d="M60.425,108.25H17.075a.825.825,0,0,0,0,1.649H60.425a.825.825,0,1,0,0-1.649Z" transform="translate(0 -48.649)" fill="#fff"/>
      <path id="Path_204" data-name="Path 204" d="M46.166,51.654v.424h-.424a.825.825,0,0,0,0,1.649h.424v.424a.825.825,0,0,0,1.649,0v-.424h.424a.825.825,0,1,0,0-1.649h-.424v-.424a.825.825,0,0,0-1.649,0Z" transform="translate(-15.159 -18.285)" fill="#fff"/>
      <path id="Path_205" data-name="Path 205" d="M60.315,19.148h.424v.422a.825.825,0,0,0,1.649,0v-.422h.424a.825.825,0,1,0,0-1.649h-.424v-.424a.825.825,0,1,0-1.649,0V17.5h-.424a.825.825,0,1,0,0,1.649Z" transform="translate(-22.865)" fill="#fff"/>
      <path id="Path_206" data-name="Path 206" d="M64.982,38.763v.422h-.424a.825.825,0,0,0,0,1.649h.424v.424a.825.825,0,0,0,1.649,0v-.424h.424a.825.825,0,1,0,0-1.649h-.424v-.422a.825.825,0,1,0-1.649,0Z" transform="translate(-25.109 -11.469)" fill="#fff"/>
      <path id="Path_207" data-name="Path 207" d="M40.368,33.964a2.482,2.482,0,1,0-2.482-2.482A2.482,2.482,0,0,0,40.368,33.964Zm0-3.315a.833.833,0,1,1-.833.833A.833.833,0,0,1,40.368,30.649Z" transform="translate(-11.441 -6.742)" fill="#fff"/>
      <path id="Path_208" data-name="Path 208" d="M82.061,31.256a2.482,2.482,0,1,0-2.482-2.482,2.482,2.482,0,0,0,2.482,2.482Zm0-3.315a.833.833,0,1,1-.833.833.833.833,0,0,1,.833-.833Z" transform="translate(-33.488 -5.31)" fill="#fff"/>
      <path id="Path_209" data-name="Path 209" d="M67.118,61.214A2.482,2.482,0,1,0,69.6,58.732,2.482,2.482,0,0,0,67.118,61.214Zm3.315,0a.833.833,0,1,1-.833-.833.833.833,0,0,1,.833.833Z" transform="translate(-26.899 -22.464)" fill="#fff"/>
    </g>
  </g>
</svg>
