<svg xmlns="http://www.w3.org/2000/svg" xmlns:xlink="http://www.w3.org/1999/xlink" width="116" height="116" viewBox="0 0 116 116">
  <defs>
    <linearGradient id="linear-gradient" x1="0.5" x2="0.5" y2="1" gradientUnits="objectBoundingBox">
      <stop offset="0" stop-color="#e31f25"/>
      <stop offset="1" stop-color="#e31f25"/>
    </linearGradient>
    <filter id="Area_SIZE:LARGE_STATE:DEFAULT_STYLE:STYLE2_" x="0" y="0" width="116" height="116" filterUnits="userSpaceOnUse">
      <feOffset dy="10" input="SourceAlpha"/>
      <feGaussianBlur stdDeviation="6" result="blur"/>
      <feFlood flood-opacity="0.22"/>
      <feComposite operator="in" in2="blur"/>
      <feComposite in="SourceGraphic"/>
    </filter>
  </defs>
  <g id="Circle_Button_" data-name="Circle Button " transform="translate(18.16 18.178)">
    <g transform="matrix(1, 0, 0, 1, -18.16, -18.18)" filter="url(#Area_SIZE:LARGE_STATE:DEFAULT_STYLE:STYLE2_)">
      <rect id="Area_SIZE:LARGE_STATE:DEFAULT_STYLE:STYLE2_2" data-name="Area [SIZE:LARGE][STATE:DEFAULT][STYLE:STYLE2]" width="80" height="80" rx="40" transform="translate(18 8)" fill="url(#linear-gradient)"/>
    </g>
    <g id="infographic" transform="translate(14.84 4.863)">
      <path id="Path_130" data-name="Path 130" d="M48.958,25.083H1.042a1.042,1.042,0,1,1,0-2.083H48.958a1.042,1.042,0,0,1,0,2.083Z" transform="translate(0 23.834)" fill="#fff"/>
      <path id="Path_131" data-name="Path 131" d="M12.458,31.583H2.042A1.042,1.042,0,0,1,1,30.542V19.083A2.085,2.085,0,0,1,3.083,17h8.333A2.085,2.085,0,0,1,13.5,19.083V30.542A1.042,1.042,0,0,1,12.458,31.583ZM3.083,29.5h8.333V19.083H3.083Z" transform="translate(1.083 17.334)" fill="#fff"/>
      <path id="Path_132" data-name="Path 132" d="M20.458,38.083H10.042A1.042,1.042,0,0,1,9,37.042V13.083A2.085,2.085,0,0,1,11.083,11h8.333A2.085,2.085,0,0,1,21.5,13.083V37.042A1.042,1.042,0,0,1,20.458,38.083ZM11.083,36h8.333V13.083H11.083Z" transform="translate(9.75 10.834)" fill="#fff"/>
      <path id="Path_133" data-name="Path 133" d="M28.458,35.917H18.042A1.042,1.042,0,0,1,17,34.875V15.083A2.085,2.085,0,0,1,19.083,13h8.333A2.085,2.085,0,0,1,29.5,15.083V34.875A1.042,1.042,0,0,1,28.458,35.917Zm-9.375-2.083h8.333V15.083H19.083Z" transform="translate(18.417 13)" fill="#fff"/>
      <path id="Path_134" data-name="Path 134" d="M3.042,21.834A1.041,1.041,0,0,1,2.3,20.057L12.721,9.64a1.034,1.034,0,0,1,.99-.275l16.1,4.023L41.89,1.3a1.042,1.042,0,1,1,1.473,1.473l-12.5,12.5a1.037,1.037,0,0,1-.99.273l-16.1-4.021-10,10a1.038,1.038,0,0,1-.735.3Z" transform="translate(2.166 0)" fill="#fff"/>
      <path id="Path_135" data-name="Path 135" d="M26.375,11.417a1.042,1.042,0,0,1-1.042-1.042V3.083H18.042a1.042,1.042,0,0,1,0-2.083h8.333a1.042,1.042,0,0,1,1.042,1.042v8.333A1.042,1.042,0,0,1,26.375,11.417Z" transform="translate(18.417 0)" fill="#fff"/>
    </g>
  </g>
</svg>
