<svg xmlns="http://www.w3.org/2000/svg" xmlns:xlink="http://www.w3.org/1999/xlink" width="140" height="140" viewBox="0 0 140 140">
  <defs>
    <linearGradient id="linear-gradient" x1="0.5" x2="0.5" y2="1" gradientUnits="objectBoundingBox">
      <stop offset="0" stop-color="#e31f25"/>
      <stop offset="1" stop-color="#ff1f26"/>
    </linearGradient>
    <filter id="Area_SIZE:LARGE_STATE:DEFAULT_STYLE:STYLE2_" x="0" y="0" width="140" height="140" filterUnits="userSpaceOnUse">
      <feOffset dy="3" input="SourceAlpha"/>
      <feGaussianBlur stdDeviation="10" result="blur"/>
      <feFlood flood-opacity="0.082"/>
      <feComposite operator="in" in2="blur"/>
      <feComposite in="SourceGraphic"/>
    </filter>
  </defs>
  <g id="Circle_Button_" data-name="Circle Button " transform="translate(30.097 36.178)">
    <g transform="matrix(1, 0, 0, 1, -30.1, -36.18)" filter="url(#Area_SIZE:LARGE_STATE:DEFAULT_STYLE:STYLE2_)">
      <rect id="Area_SIZE:LARGE_STATE:DEFAULT_STYLE:STYLE2_2" data-name="Area [SIZE:LARGE][STATE:DEFAULT][STYLE:STYLE2]" width="80" height="80" rx="40" transform="translate(30 27)" fill="url(#linear-gradient)"/>
    </g>
    <g id="thermometer" transform="translate(-68.169 0.821)">
      <g id="Group_490" data-name="Group 490" transform="translate(91.071)">
        <g id="Group_489" data-name="Group 489">
          <path id="Path_163" data-name="Path 163" d="M113.569,33.069V7.871a7.871,7.871,0,0,0-15.743,0V33.057a14.613,14.613,0,0,0,7.832,26.931l.078.011a14.613,14.613,0,0,0,7.832-26.931ZM99.549,56.11a12.386,12.386,0,0,1,0-21.453,1.119,1.119,0,0,0,.559-.973V7.871a5.634,5.634,0,0,1,11.267,0V33.684a1.119,1.119,0,0,0,.559.973A12.386,12.386,0,1,1,99.549,56.11Z" transform="translate(-91.071 0)" fill="#fff"/>
        </g>
      </g>
      <g id="Group_492" data-name="Group 492" transform="translate(97.983 19.25)">
        <g id="Group_491" data-name="Group 491">
          <path id="Path_164" data-name="Path 164" d="M149.362,155.732V138.759a1.119,1.119,0,1,0-2.238,0v16.973a7.753,7.753,0,1,0,2.238,0Zm-1.119,13.136a5.494,5.494,0,0,1,0-10.987h0a5.494,5.494,0,0,1,0,10.987Z" transform="translate(-140.489 -137.64)" fill="#fff"/>
        </g>
      </g>
      <g id="Group_494" data-name="Group 494" transform="translate(116.366 7.692)">
        <g id="Group_493" data-name="Group 493">
          <path id="Path_165" data-name="Path 165" d="M280.041,55h-6.993a1.119,1.119,0,1,0,0,2.238h6.993a1.119,1.119,0,1,0,0-2.238Z" transform="translate(-271.929 -55)" fill="#fff"/>
        </g>
      </g>
      <g id="Group_496" data-name="Group 496" transform="translate(117.765 13.287)">
        <g id="Group_495" data-name="Group 495">
          <path id="Path_166" data-name="Path 166" d="M287.154,95h-4.106a1.119,1.119,0,1,0,0,2.238h4.106a1.119,1.119,0,0,0,0-2.238Z" transform="translate(-281.929 -95)" fill="#fff"/>
        </g>
      </g>
      <g id="Group_498" data-name="Group 498" transform="translate(116.366 18.881)">
        <g id="Group_497" data-name="Group 497">
          <path id="Path_167" data-name="Path 167" d="M280.041,135h-6.993a1.119,1.119,0,1,0,0,2.238h6.993a1.119,1.119,0,1,0,0-2.238Z" transform="translate(-271.929 -135)" fill="#fff"/>
        </g>
      </g>
      <g id="Group_500" data-name="Group 500" transform="translate(117.765 24.476)">
        <g id="Group_499" data-name="Group 499">
          <path id="Path_168" data-name="Path 168" d="M287.154,175h-4.106a1.119,1.119,0,1,0,0,2.238h4.106a1.119,1.119,0,0,0,0-2.238Z" transform="translate(-281.929 -175)" fill="#fff"/>
        </g>
      </g>
      <g id="Group_502" data-name="Group 502" transform="translate(116.366 30.07)">
        <g id="Group_501" data-name="Group 501">
          <path id="Path_169" data-name="Path 169" d="M280.041,215h-6.993a1.119,1.119,0,1,0,0,2.238h6.993a1.119,1.119,0,1,0,0-2.238Z" transform="translate(-271.929 -215)" fill="#fff"/>
        </g>
      </g>
    </g>
  </g>
</svg>
