{
	"info": {
		"_postman_id": "2e29172b-e455-4816-9141-7576e9e2c26e",
		"name": "CHALLENGE",
		"schema": "https://schema.getpostman.com/json/collection/v2.1.0/collection.json"
	},
	"item": [
		{
			"name": "/challenger qet token",
			"event": [
				{
					"listen": "test",
					"script": {
						"exec": [
							"//Записываем значение конкретного хедера в переменную\r",
							"let userToken=pm.response.headers.get('X-Challenger');\r",
							"\r",
							"//Выводим в консоль значение нашей переменной\r",
							"console.log(userToken);\r",
							"\r",
							"//Записать переменную в переменные коллекции\r",
							"pm.collectionVariables.set('userID',userToken);\r",
							"pm.test(\"Status code is 201\", function () {\r",
							"    pm.response.to.have.status(201);\r",
							"});\r",
							""
						],
						"type": "text/javascript"
					}
				}
			],
			"request": {
				"method": "POST",
				"header": [],
				"url": {
					"raw": "https://apichallenges.herokuapp.com/challenger",
					"protocol": "https",
					"host": [
						"apichallenges",
						"herokuapp",
						"com"
					],
					"path": [
						"challenger"
					]
				}
			},
			"response": []
		},
		{
			"name": "/challenges get list challenges",
			"event": [
				{
					"listen": "test",
					"script": {
						"exec": [
							"pm.test(\"Status code is 200\", function () {\r",
							"    pm.response.to.have.status(200);\r",
							"});\r",
							"pm.test(\"Тест засчитан\", function () {\r",
							"let rBody = JSON.parse(responseBody);\r",
							"pm.expect(rBody.challenges[0].status).to.eql(true);\r",
							"\r",
							"});\r",
							""
						],
						"type": "text/javascript"
					}
				}
			],
			"request": {
				"method": "GET",
				"header": [
					{
						"key": "X-Challenger",
						"value": "{{userID}}",
						"type": "text"
					}
				],
				"url": {
					"raw": "https://apichallenges.herokuapp.com/challenges",
					"protocol": "https",
					"host": [
						"apichallenges",
						"herokuapp",
						"com"
					],
					"path": [
						"challenges"
					]
				}
			},
			"response": []
		}
	],
	"variable": [
		{
			"key": "userID",
			"value": ""
		}
	]
}