<svg width="40" height="36" viewBox="0 0 40 36" fill="none" xmlns="http://www.w3.org/2000/svg">
<circle cx="28.8997" cy="25.5" r="10.5" fill="#FD72A4" fill-opacity="0.3"/>
<g clip-path="url(#clip0_1_75)">
<path d="M33.9013 28.1744C33.9011 28.1744 33.9009 28.1744 33.9007 28.1744L31.9948 28.1766L31.9927 26.569C31.9924 26.294 31.7693 26.0712 31.4943 26.0712C31.4941 26.0712 31.4939 26.0712 31.4937 26.0712C31.2184 26.0715 30.9955 26.2949 30.9959 26.5702L30.9979 28.1778L23.5414 28.1864L23.534 21.7994L28.6946 21.7934C28.9579 21.7931 29.2053 21.6903 29.3913 21.504C29.5772 21.3176 29.6794 21.0699 29.6791 20.8066L29.6731 15.5992C29.6728 15.3359 29.57 15.0885 29.3837 14.9026C29.1976 14.717 28.9504 14.6148 28.6875 14.6148C28.6871 14.6148 28.6867 14.6148 28.6863 14.6148L23.5256 14.6207L23.5233 12.5595L30.9798 12.551L30.9931 24.3106C30.9935 24.5857 31.2165 24.8085 31.4916 24.8085H31.4922C31.7675 24.8081 31.9904 24.5848 31.99 24.3095L31.9767 12.5498L32.9577 12.5487C33.715 12.5477 34.3303 11.9308 34.3293 11.1739L34.328 9.86657C34.327 9.10944 33.7108 8.49426 32.9544 8.49426C32.9538 8.49426 32.9531 8.49426 32.9525 8.49426L29.76 8.49758C29.4847 8.49785 29.2618 8.72127 29.2621 8.99653C29.2624 9.27166 29.4855 9.49442 29.7605 9.49442H29.7611L32.9537 9.49109H32.9542C33.1618 9.49109 33.3309 9.66002 33.3311 9.86776L33.3324 11.1751C33.3327 11.3826 33.164 11.5516 32.9564 11.5519L23.5221 11.5626L23.5197 9.50179L27.5016 9.49707C27.7768 9.49674 27.9997 9.27332 27.9994 8.99806C27.999 8.723 27.776 8.50024 27.501 8.50024C27.5008 8.50024 27.5006 8.50024 27.5004 8.50024L23.5186 8.50496L23.5159 6.16465C23.5155 5.79715 23.3719 5.45178 23.1118 5.19227C22.852 4.9331 22.5069 4.79048 22.14 4.79048C22.1395 4.79048 22.1389 4.79048 22.1384 4.79048L12.6053 4.80151C12.2378 4.80191 11.8924 4.94546 11.6329 5.20563C11.3734 5.4658 11.2307 5.81144 11.2311 6.17894L11.2339 8.51931L1.79935 8.53028C1.43245 8.53067 1.08767 8.67409 0.828564 8.93406C0.569652 9.19384 0.427304 9.53894 0.427769 9.90571L0.429231 11.2132C0.42963 11.5801 0.572909 11.9248 0.832485 12.1837C1.09173 12.4424 1.4361 12.5847 1.80227 12.5847H1.804L2.79067 12.5836V14.0759C2.79067 14.3512 3.01383 14.5744 3.28909 14.5744C3.56435 14.5744 3.7875 14.3512 3.7875 14.0759V12.5824L11.2385 12.5738L11.2408 14.6348L6.08056 14.6408C5.81719 14.6411 5.56978 14.7439 5.38384 14.9302C5.19789 15.1166 5.09568 15.3642 5.09602 15.6276L5.102 20.835C5.10233 21.0983 5.20514 21.3458 5.39148 21.5317C5.57755 21.7173 5.8247 21.8195 6.0876 21.8195H6.08887L11.2492 21.8136L11.2566 28.2006L3.78757 28.2093V16.3355C3.78757 16.0602 3.56441 15.8371 3.28915 15.8371C3.01389 15.8371 2.79073 16.0602 2.79073 16.3355V28.2105L0.897545 28.2127C0.622219 28.213 0.399326 28.4364 0.399659 28.7117C0.399991 28.9867 0.623016 29.2095 0.898076 29.2095H0.898674L33.9018 29.1713C34.1771 29.171 34.4 28.9475 34.3997 28.6723C34.3993 28.3973 34.1763 28.1744 33.9013 28.1744V28.1744ZM28.6762 15.6116L28.6822 20.7966L23.5328 20.8026L23.5268 15.6176L28.6762 15.6116ZM1.80287 11.588C1.80274 11.588 1.8026 11.588 1.80241 11.588C1.70199 11.588 1.60762 11.549 1.53658 11.4781C1.46548 11.4071 1.4262 11.3127 1.42607 11.2121L1.4246 9.90458C1.42447 9.80383 1.46355 9.70913 1.53466 9.63776C1.60563 9.56652 1.70006 9.52724 1.80054 9.52711L11.235 9.51621L11.2374 11.5771L1.80287 11.588ZM6.0989 20.8228L6.09292 15.6378L11.242 15.6318L11.248 20.8168L6.0989 20.8228ZM12.2279 6.17781C12.2278 6.0766 12.2671 5.98137 12.3386 5.90973C12.4101 5.83809 12.5052 5.79855 12.6064 5.79842L22.1396 5.78738H22.14C22.3488 5.78738 22.5188 5.95711 22.519 6.16592L22.5445 28.1877L21.2988 28.1891L21.2887 19.3995C21.2882 18.9793 21.1269 18.584 20.8345 18.2864C20.5398 17.9867 20.1477 17.8216 19.7301 17.8216C19.7295 17.8216 19.7288 17.8216 19.7282 17.8216L15.0458 17.8271C14.6276 17.8276 14.2351 17.9936 13.9407 18.2945C13.649 18.5927 13.4886 18.9883 13.4891 19.4086L13.4993 28.1982L12.2534 28.1997L12.2279 6.17781ZM14.4859 19.4073C14.4857 19.2496 14.5452 19.1019 14.6533 18.9914C14.7589 18.8835 14.8987 18.8239 15.047 18.8238L19.7294 18.8183H19.7301C19.8782 18.8183 20.0178 18.8776 20.1234 18.985C20.2318 19.0953 20.2916 19.2429 20.2918 19.4005L20.302 28.1901L14.4961 28.1968L14.4859 19.4073Z" fill="#FC5285"/>
<path d="M14.1568 13.3017H14.158L15.8199 13.2997L15.8218 14.9617C15.8224 15.4744 16.2398 15.891 16.7522 15.891H16.7534L18.0163 15.8896C18.2649 15.8893 18.4985 15.7923 18.674 15.6163C18.8496 15.4404 18.9461 15.2065 18.9457 14.958L18.9438 13.2961L20.6057 13.2941C21.1187 13.2936 21.5356 12.8757 21.5351 12.3626L21.5336 11.0996C21.5334 10.851 21.4363 10.6175 21.2603 10.4419C21.0846 10.2666 20.8513 10.1702 20.6032 10.1702C20.6029 10.1702 20.6024 10.1702 20.602 10.1702L18.9401 10.1721L18.9381 8.51027C18.9379 8.26172 18.8409 8.0282 18.6649 7.85262C18.4892 7.67731 18.2558 7.58082 18.0078 7.58082C18.0074 7.58082 18.007 7.58082 18.0066 7.58082L16.7436 7.58228C16.495 7.58255 16.2615 7.67964 16.0859 7.85561C15.9104 8.03152 15.8139 8.26538 15.8142 8.51386L15.8161 10.1758L14.1543 10.1777C13.9057 10.178 13.6721 10.275 13.4966 10.451C13.321 10.6269 13.2246 10.8607 13.2249 11.1093L13.2263 12.3722C13.2266 12.6208 13.3236 12.8543 13.4996 13.0299C13.6754 13.2052 13.9087 13.3017 14.1568 13.3017V13.3017ZM16.3159 11.1721C16.5911 11.1718 16.814 10.9483 16.8137 10.6731L16.8112 8.57912L17.9414 8.57779L17.9439 10.6718C17.9439 10.689 17.9448 10.706 17.9466 10.7227C17.9723 10.9738 18.1845 11.1696 18.4423 11.1696H18.4429L20.5369 11.1672L20.5382 12.2974L18.4442 12.2998C18.1689 12.3002 17.946 12.5236 17.9464 12.7989L17.9488 14.8928L16.8185 14.8941L16.8161 12.8001C16.8158 12.5251 16.5927 12.3023 16.3177 12.3023C16.3175 12.3023 16.3173 12.3023 16.3171 12.3023L14.2231 12.3048L14.2218 11.1745L16.3159 11.1721Z" fill="#FC5285"/>
</g>
<defs>
<clipPath id="clip0_1_75">
<rect width="34" height="34" fill="white" transform="translate(0.399658)"/>
</clipPath>
</defs>
</svg>
