module github.com/hitheshchoudhary/mongoapi

go 1.18

require go.mongodb.org/mongo-driver v1.10.1

require (
	github.com/golang/snappy v0.0.4 // indirect
	github.com/gorilla/mux v1.8.0
	github.com/klauspost/compress v1.15.9 // indirect
	github.com/montanaflynn/stats v0.6.6 // indirect
	github.com/pkg/errors v0.9.1 // indirect
	github.com/xdg-go/pbkdf2 v1.0.0 // indirect
	github.com/xdg-go/scram v1.1.1 // indirect
	github.com/xdg-go/stringprep v1.0.3 // indirect
	github.com/youmark/pkcs8 v0.0.0-20201027041543-1326539a0a0a // indirect
	golang.org/x/crypto v0.0.0-20220824171710-5757bc0c5503 // indirect
	golang.org/x/sync v0.0.0-20220819030929-7fc1605a5dde // indirect
	golang.org/x/text v0.3.7 // indirect
)
