module github.com/hitheshchoudhary/mymodules

go 1.18

//sum is created  becuase when we donwload anyrthing from internet or update i from internet mallicious attackers can inject anthing to avoid that hashing is used
//here hash in sum is verified with things in github if it matches it allows to connect
//go.sum gives us hash ,so we can verify that some mallicious activities is going on github repository
//adasda

require github.com/gorilla/mux v1.8.0 // indirect
