{
  "IcoMoonType": "selection",
  "icons": [
    {
      "icon": {
        "paths": [
          "M294.093 224.461h225.28v474.317h-225.28v-474.317z",
          "M546.406 217.907h-278.528l-25.395-36.045h329.318z",
          "M327.68 191.693h-10.65v-50.79c0-23.757 19.661-43.418 43.418-43.418h19.661v10.65h-19.661c-18.022 0-32.768 14.746-32.768 32.768v50.79z",
          "M403.866 102.4c0 10.406-10.636 18.842-23.757 18.842s-23.757-8.436-23.757-18.842c0-10.406 10.636-18.842 23.757-18.842s23.757 8.436 23.757 18.842z"
        ],
        "attrs": [
          {},
          {},
          {},
          {}
        ],
        "width": 819,
        "isMulticolor": false,
        "isMulticolor2": false,
        "grid": 0,
        "tags": [
          "Model_UN2"
        ]
      },
      "attrs": [
        {},
        {},
        {},
        {}
      ],
      "properties": {
        "order": 21,
        "id": 15,
        "name": "Model_UN2",
        "prevSize": 32,
        "code": 59648
      },
      "setIdx": 0,
      "setId": 2,
      "iconIdx": 0
    },
    {
      "icon": {
        "paths": [
          "M180.067 267.396c2.567 3.564 6.69 5.68 11.087 5.68h0.041c4.41-0.027 8.547-2.171 11.087-5.762l18.855-26.61c32.836-45.971 32.836-107.766 0.014-153.696l-16.357-23.088-0.014-50.272c0-7.537-6.117-13.64-13.653-13.64v0c-7.55 0-13.653 6.117-13.653 13.653l0.014 50.203-16.63 23.101c-32.836 45.984-32.836 107.766 0.041 153.805l19.169 26.624z",
          "M43.202 240.030l4.56 28.085c9.298 55.747 52.989 99.437 108.776 108.735l32.399 5.27c0.724 0.123 1.461 0.177 2.185 0.177h0.027c0.724 0 1.461-0.055 2.198-0.177l32.427-5.284c55.747-9.284 99.437-52.975 108.735-108.776l4.56-28.044 39.199-39.212c5.338-5.338 5.338-13.981 0-19.319-5.325-5.311-13.967-5.325-19.306 0.014l-39.24 39.253-27.825 4.751c-45.998 7.66-83.722 38.789-100.762 80.746-17.026-41.957-54.75-73.073-100.707-80.732l-27.88-4.765-39.24-39.253c-5.325-5.338-13.981-5.325-19.306-0.014-5.338 5.338-5.338 13.981 0 19.319l39.199 39.226z",
          "M358.961 331.683l-39.24 39.253-27.825 4.751c-45.998 7.66-83.722 38.789-100.762 80.746-17.026-41.957-54.75-73.073-100.707-80.732l-27.88-4.765-39.24-39.253c-5.325-5.338-13.967-5.325-19.306 0s-5.338 13.967 0 19.306l39.199 39.226 4.574 28.085c9.284 55.747 52.975 99.437 108.762 108.735l32.399 5.27c0.737 0.123 1.461 0.177 2.198 0.177v0h0.014c0.724 0 1.461-0.055 2.198-0.177l32.427-5.284c55.747-9.284 99.437-52.975 108.735-108.776l4.56-28.044 39.212-39.212c5.325-5.338 5.325-13.981 0-19.306-5.338-5.325-13.981-5.338-19.319 0z",
          "M191.147 709.976c-15.060 0-27.307-12.247-27.307-27.307 0-1.406 0.123-2.813 0.355-4.205l24.74 4.028c0.737 0.123 1.461 0.177 2.198 0.177v0h0.014c0.724 0 1.461-0.055 2.198-0.177l24.753-4.028c0.232 1.393 0.355 2.799 0.355 4.205 0 15.060-12.247 27.307-27.307 27.307zM358.96 481.87l-39.24 39.253-27.825 4.751c-45.998 7.66-83.722 38.789-100.762 80.746-17.012-41.957-54.75-73.073-100.707-80.732l-27.88-4.765-39.24-39.253c-5.325-5.338-13.967-5.325-19.306-0.014-5.338 5.338-5.338 13.981 0 19.319l39.199 39.226 4.574 28.085c8.206 49.261 43.308 89.074 89.853 104.079-0.655 3.331-1.092 6.69-1.092 10.103 0 25.368 17.476 46.572 40.96 52.675v70.205c0 7.537 6.117 13.653 13.653 13.653s13.653-6.117 13.653-13.653v-70.205c23.484-6.103 40.96-27.307 40.96-52.675 0-3.413-0.437-6.772-1.092-10.103 46.531-15.005 81.62-54.818 89.839-104.134l4.56-28.044 39.212-39.212c5.325-5.338 5.325-13.981 0-19.319-5.338-5.311-13.981-5.325-19.319 0.014z"
        ],
        "attrs": [
          {},
          {},
          {},
          {}
        ],
        "width": 382,
        "isMulticolor": false,
        "isMulticolor2": false,
        "grid": 0,
        "tags": [
          "Agriculture"
        ]
      },
      "attrs": [
        {},
        {},
        {},
        {}
      ],
      "properties": {
        "order": 22,
        "id": 14,
        "name": "Agriculture",
        "prevSize": 32,
        "code": 59649
      },
      "setIdx": 0,
      "setId": 2,
      "iconIdx": 1
    },
    {
      "icon": {
        "paths": [
          "M927.58 74.68c-28.467-25.477-241.674 194.191-289.096 246.19-42.107 46.172-256.195 288.43-278.221 360.847 4.526 2.836 9.011 6.031 13.414 9.626 2.509 2.028 4.854 4.168 7.117 6.349 73.339-34.58 304.712-280.494 338.995-321.495 38.4-45.916 229.253-282.317 207.79-301.517z",
          "M353.761 708.854c-44.012-35.86-89.6-21.801-124.047 17.971-34.099 39.383-27.116 104.755-30.72 126.7-8.151 49.715-104.264 89.917-104.264 89.917s118.385 36.557 218.665-47.258c66.836-55.859 97.352-140.913 40.366-187.331z"
        ],
        "attrs": [
          {},
          {}
        ],
        "isMulticolor": false,
        "isMulticolor2": false,
        "grid": 0,
        "tags": [
          "Art_culture"
        ]
      },
      "attrs": [
        {},
        {}
      ],
      "properties": {
        "order": 23,
        "id": 13,
        "name": "Art_culture",
        "prevSize": 32,
        "code": 59650
      },
      "setIdx": 0,
      "setId": 2,
      "iconIdx": 2
    },
    {
      "icon": {
        "paths": [
          "M543.949 279.347c0.819-6.554 1.638-13.107 1.638-19.661 0-65.536-53.248-118.784-118.784-118.784s-118.784 53.248-118.784 118.784c0 6.554 0.819 13.107 1.638 19.661-54.067 0.819-97.485 45.056-97.485 99.123v0c0 54.886 45.056 99.123 99.123 99.123h231.014c54.886 0 99.123-45.056 99.123-99.123v0c0-54.067-44.237-98.304-97.485-99.123z",
          "M385.843 544.768c6.554-11.469 3.277-27.034 3.277-27.034s-16.384 4.096-22.938 14.746c-3.277 5.734-1.638 12.288 4.096 16.384 4.915 3.277 12.288 1.638 15.565-4.096z",
          "M472.678 533.299c-3.277 5.734-1.638 12.288 4.096 16.384 5.734 3.277 12.288 1.638 16.384-4.096 6.554-11.469 3.277-27.034 3.277-27.034s-17.203 3.277-23.757 14.746z",
          "M404.685 575.898c-3.277 5.734-1.638 12.288 4.096 16.384 5.734 3.277 12.288 1.638 16.384-4.096 6.554-11.469 3.277-27.034 3.277-27.034s-17.203 3.277-23.757 14.746z",
          "M331.776 592.282c-3.277 5.734-1.638 12.288 4.096 16.384 5.734 3.277 12.288 1.638 16.384-4.096 6.554-11.469 3.277-27.034 3.277-27.034s-16.384 3.277-23.757 14.746z",
          "M447.283 631.603c-3.277 5.734-1.638 12.288 4.096 16.384 5.734 3.277 12.288 1.638 16.384-4.096 6.554-11.469 3.277-27.034 3.277-27.034s-17.203 3.277-23.757 14.746z",
          "M379.29 642.253c-3.277 5.734-1.638 12.288 4.096 16.384 5.734 3.277 12.288 1.638 16.384-4.096 6.554-11.469 3.277-27.034 3.277-27.034s-17.203 4.096-23.757 14.746z"
        ],
        "attrs": [
          {},
          {},
          {},
          {},
          {},
          {},
          {}
        ],
        "width": 819,
        "isMulticolor": false,
        "isMulticolor2": false,
        "grid": 0,
        "tags": [
          "Climate"
        ]
      },
      "attrs": [
        {},
        {},
        {},
        {},
        {},
        {},
        {}
      ],
      "properties": {
        "order": 24,
        "id": 12,
        "name": "Climate",
        "prevSize": 32,
        "code": 59651
      },
      "setIdx": 0,
      "setId": 2,
      "iconIdx": 3
    },
    {
      "icon": {
        "paths": [
          "M489.062 30.31c-172.032 0-311.296 122.061-311.296 273.613s139.264 273.613 311.296 273.613c62.259 0 120.422-16.384 169.574-44.237 44.237 26.214 91.75 25.395 118.784 21.299 8.192-0.819 9.83-11.469 3.277-15.565-27.034-17.203-40.96-41.779-49.152-63.898 43.418-46.694 69.632-106.496 69.632-172.032-0-150.733-140.083-272.794-312.115-272.794zM589.005 394.035h-315.392c0-44.237 24.576-81.92 58.982-92.57-13.107-7.373-21.299-20.48-21.299-36.045 0-22.938 18.022-40.96 40.96-40.96s40.96 18.022 40.96 40.96c0 15.565-9.011 28.672-21.299 36.045 13.107 4.096 25.395 13.107 35.226 24.576 13.107-24.576 33.587-42.598 58.163-49.971-16.384-9.011-27.034-26.214-27.034-45.875 0-28.672 23.757-52.429 52.429-52.429s52.429 23.757 52.429 52.429c0 19.661-11.469 36.864-27.034 45.875 23.757 7.373 44.237 25.395 58.163 49.971 9.83-11.469 21.299-19.661 35.226-24.576-12.288-6.554-21.299-20.48-21.299-36.045 0-22.938 18.022-40.96 40.96-40.96s40.96 18.022 40.96 40.96c0 15.565-9.011 28.672-21.299 36.045 31.13 10.65 55.706 48.333 55.706 92.57h-115.507zM489.062 630.784c12.288 0 24.576-0.819 36.045-1.638-32.768 92.57-131.072 160.563-248.218 160.563-51.61 0-99.942-13.107-140.902-36.864-36.864 22.118-76.186 21.299-99.123 18.022-6.554-0.819-8.192-9.011-2.458-13.107 22.118-14.746 34.406-35.226 40.96-53.248-36.045-39.322-57.344-88.474-57.344-142.541 0-77.824 45.056-147.456 113.869-188.416 36.045 146.637 182.682 257.229 357.171 257.229z"
        ],
        "attrs": [
          {}
        ],
        "width": 819,
        "isMulticolor": false,
        "isMulticolor2": false,
        "grid": 0,
        "tags": [
          "Debate"
        ]
      },
      "attrs": [
        {}
      ],
      "properties": {
        "order": 25,
        "id": 11,
        "name": "Debate",
        "prevSize": 32,
        "code": 59652
      },
      "setIdx": 0,
      "setId": 2,
      "iconIdx": 4
    },
    {
      "icon": {
        "paths": [
          "M743.014 0l-134.349 231.834-222.003 384.205-26.214 45.875-129.434 78.643 1.638-76.186 384.205-664.371h126.157zM271.155 176.128l-161.382 280.166-26.214 45.875-4.096 151.552 67.174-40.96 353.894-612.762h-126.976l-102.4 176.128zM110.592 814.285l63.078-38.502-95.027-55.706-1.638 73.728c-0.819 22.938 14.746 31.949 33.587 20.48zM220.365 657.818l379.29-657.818h-81.92l-360.448 624.23-1.638 72.909 64.717-39.322z"
        ],
        "attrs": [
          {}
        ],
        "width": 819,
        "isMulticolor": false,
        "isMulticolor2": false,
        "grid": 0,
        "tags": [
          "Education_&_Training"
        ]
      },
      "attrs": [
        {}
      ],
      "properties": {
        "order": 26,
        "id": 10,
        "name": "Education_n_Training",
        "prevSize": 32,
        "code": 59653
      },
      "setIdx": 0,
      "setId": 2,
      "iconIdx": 5
    },
    {
      "icon": {
        "paths": [
          "M728.277 239.952h-135.61c0.246-1.393 0.434-2.802 0.434-4.268v-113.656c0-13.574-11.002-24.576-24.576-24.576h-306.201c-13.574 0-24.576 11.002-24.576 24.576v113.656c0 1.458 0.18 2.875 0.434 4.268h-135.61c-18.022 0-32.768 14.746-32.768 32.768v391.676c0 18.022 14.746 32.768 32.768 32.768h625.713c18.022 0 32.768-14.746 32.768-32.768v-391.676c-0.008-18.022-14.746-32.768-32.776-32.768zM286.9 235.692v-89.088h257.040v89.080c0 1.458 0.18 2.875 0.434 4.268h-257.901c0.246-1.393 0.426-2.802 0.426-4.26z"
        ],
        "attrs": [
          {}
        ],
        "width": 819,
        "isMulticolor": false,
        "isMulticolor2": false,
        "grid": 0,
        "tags": [
          "Employment"
        ]
      },
      "attrs": [
        {}
      ],
      "properties": {
        "order": 27,
        "id": 9,
        "name": "Employment",
        "prevSize": 32,
        "code": 59654
      },
      "setIdx": 0,
      "setId": 2,
      "iconIdx": 6
    },
    {
      "icon": {
        "paths": [
          "M193.905 97.272c0 31.1-25.212 56.312-56.312 56.312s-56.312-25.212-56.312-56.312c0-31.1 25.212-56.312 56.312-56.312s56.312 25.212 56.312 56.312z",
          "M681.607 49.152c26.534 0 48.12 21.586 48.12 48.12s-21.586 48.12-48.12 48.12-48.12-21.586-48.12-48.12 21.586-48.12 48.12-48.12zM681.607 40.96c-31.097 0-56.312 25.215-56.312 56.312s25.215 56.312 56.312 56.312c31.097 0 56.312-25.215 56.312-56.312s-25.215-56.312-56.312-56.312v0z",
          "M489.325 778.24l-79.725-138.084-79.725 138.084z",
          "M758.079 395.518v0c11.133 0 20.161-9.028 20.161-20.161v-201.613c0-11.133-9.028-20.161-20.161-20.161v0h-33.423c-11.96 9.167-26.862 14.68-43.057 14.68s-31.097-5.513-43.057-14.68h-33.423c-11.133 0-20.161 9.028-20.161 20.161v201.613c0 11.133 9.028 20.161 20.161 20.161s20.161-9.028 20.161-20.161v-131.154h3.211v337.986c0 12.091 9.806 21.897 21.897 21.897h-481.583c12.091 0 21.897-9.806 21.897-21.897v-337.986h3.211v131.154c0 11.133 9.028 20.161 20.161 20.161v0c11.133 0 20.161-9.028 20.161-20.161v-201.613c0-11.133-9.028-20.161-20.161-20.161v0h-33.423c-11.96 9.167-26.862 14.68-43.057 14.68s-31.097-5.513-43.057-14.68h-33.423c-11.125 0-20.152 9.028-20.152 20.161v201.613c0 11.133 9.028 20.161 20.161 20.161s20.161-9.028 20.161-20.161v-131.154h3.211v337.986c0 12.091 9.806 21.897 21.897 21.897h-47.391c-9.961 0-18.039 8.077-18.039 18.039s8.077 18.039 18.039 18.039h701.202c9.961 0 18.039-8.077 18.039-18.039s-8.077-18.039-18.039-18.039h-47.391c12.091 0 21.897-9.806 21.897-21.897v-337.986h3.211v131.154c0 11.141 9.028 20.161 20.161 20.161zM112.566 604.086c12.091 0 21.897-9.806 21.897-21.897v-232.948h6.259v232.948c0 12.091 9.806 21.897 21.897 21.897h-50.053zM656.572 604.086c12.091 0 21.897-9.806 21.897-21.897v-232.948h6.259v232.948c0 12.091 9.806 21.897 21.897 21.897h-50.053zM734.708 236.012h-8.192v346.178c0 7.561-6.152 13.705-13.705 13.705h-6.177c-7.561 0-13.705-6.152-13.705-13.705v-241.14h-22.643v241.14c0 7.561-6.152 13.705-13.705 13.705h-6.177c-7.561 0-13.705-6.152-13.705-13.705v-346.178h-19.595v139.346c0 6.603-5.366 11.969-11.969 11.969s-11.969-5.366-11.969-11.969v-201.613c0-6.603 5.366-11.969 11.969-11.969h30.72c13.484 9.609 29.237 14.68 45.752 14.68s32.268-5.063 45.752-14.68h30.72c6.603 0 11.969 5.366 11.969 11.969v201.613c0 6.603-5.366 11.969-11.969 11.969s-11.969-5.366-11.969-11.969v-139.346h-11.403z"
        ],
        "attrs": [
          {},
          {},
          {},
          {}
        ],
        "width": 819,
        "isMulticolor": false,
        "isMulticolor2": false,
        "grid": 0,
        "tags": [
          "Human_Rights"
        ]
      },
      "attrs": [
        {},
        {},
        {},
        {}
      ],
      "properties": {
        "order": 10,
        "id": 8,
        "name": "Human_Rights",
        "prevSize": 32,
        "code": 59655
      },
      "setIdx": 0,
      "setId": 2,
      "iconIdx": 7
    },
    {
      "icon": {
        "paths": [
          "M530.957 0c33.51 0 30.363 27.131 30.363 60.641l2.004 60.644h346.883v60.726h-39.436l160.777 379.25c0 58.698-96.643 106.176-197.18 106.176s-197.18-47.477-197.18-106.176l160.777-379.25h-232.639l18.289 548.013c117.191 8.586 205.221 45.274 205.221 89.176h-515.759c0-43.902 88.030-80.589 205.221-89.176l18.26-548.013h-262.917l160.777 379.25c0 58.698-96.646 106.176-197.18 106.176-100.537 0-197.239-47.477-197.239-106.176l160.777-379.25h-39.407v-60.726h377.219l2.060-60.644c0-33.51-3.206-60.641 30.307-60.641zM960.688 561.262l-111.125-275.164v275.164h111.125zM707.99 561.262h111.21v-275.164l-111.21 275.164zM323.559 561.262l-111.21-275.164v275.164h111.21zM70.831 561.262h111.24v-275.164l-111.24 275.164z"
        ],
        "attrs": [
          {}
        ],
        "width": 1032,
        "isMulticolor": false,
        "isMulticolor2": false,
        "grid": 0,
        "tags": [
          "Law"
        ]
      },
      "attrs": [
        {}
      ],
      "properties": {
        "order": 11,
        "id": 7,
        "name": "Law",
        "prevSize": 32,
        "code": 59656
      },
      "setIdx": 0,
      "setId": 2,
      "iconIdx": 8
    },
    {
      "icon": {
        "paths": [
          "M409.6 708.608v0c-12.288 0-22.118-9.83-22.118-22.118v-55.706c-43.418-4.096-85.197-21.299-118.784-49.152l-39.322 39.322c-8.192 8.192-22.118 8.192-31.13 0v0c-8.192-8.192-8.192-22.118 0-31.13l39.322-39.322c-27.853-33.587-45.056-74.547-49.152-117.965h-55.706c-12.288 0-22.118-9.83-22.118-22.118v0c0-12.288 9.83-22.118 22.118-22.118h55.706c4.096-44.237 21.299-86.016 49.152-120.422l-39.322-38.502c-8.192-8.192-8.192-22.118 0-31.13v0c8.192-8.192 22.118-8.192 31.13 0l39.322 39.322c33.587-27.853 75.366-45.056 118.784-49.152v-55.706c0-12.288 9.83-22.118 22.118-22.118v0c12.288 0 22.118 9.83 22.118 22.118v55.706c43.418 4.096 85.197 21.299 118.784 49.152l40.141-40.141c8.192-8.192 22.118-8.192 31.13 0v0c8.192 8.192 8.192 22.118 0 31.13l-40.141 40.141c27.853 34.406 45.056 76.186 49.152 120.422h55.706c12.288 0 22.118 9.83 22.118 22.118v0c0 12.288-9.83 22.118-22.118 22.118h-55.706c-4.096 43.418-21.299 84.378-49.152 117.965l40.141 40.141c8.192 8.192 8.192 22.118 0 31.13v0c-8.192 8.192-22.118 8.192-31.13 0l-40.141-40.96c-33.587 27.853-75.366 45.056-118.784 49.152v55.706c0 12.288-9.83 22.118-22.118 22.118zM299.827 550.502c25.395 19.661 55.706 32.768 87.654 36.864l10.65-131.891c-4.096-0.819-8.192-2.458-12.288-4.915l-86.016 99.942zM421.069 454.656l10.65 131.891c31.949-4.096 62.259-16.384 87.654-36.864l-86.016-99.942c-4.096 2.458-8.192 4.096-12.288 4.915zM232.653 432.538c4.096 31.949 16.384 61.44 36.045 86.835l101.581-86.016c-2.458-3.277-3.277-7.373-4.915-11.469l-132.71 10.65zM448.922 433.357l101.581 86.016c19.661-25.395 31.949-54.886 36.045-86.835l-132.71-10.65c-0.819 4.096-2.458 8.192-4.915 11.469zM453.837 399.77l133.53-10.65c-4.096-32.768-16.384-63.078-36.864-89.293l-101.581 87.654c1.638 3.277 4.096 7.373 4.915 12.288zM231.834 389.12l133.53 10.65c0.819-4.096 2.458-8.192 4.915-12.288l-101.581-87.654c-19.661 25.395-32.768 56.525-36.864 89.293zM299.827 268.698l86.835 102.4c3.277-2.458 7.373-3.277 11.469-4.915l-10.65-134.349c-31.949 4.096-62.259 17.203-87.654 36.864zM421.069 367.002c4.096 0.819 8.192 2.458 11.469 4.915l86.835-102.4c-25.395-19.661-55.706-32.768-87.654-36.864l-10.65 134.349z"
        ],
        "attrs": [
          {}
        ],
        "width": 819,
        "isMulticolor": false,
        "isMulticolor2": false,
        "grid": 0,
        "tags": [
          "Leadership"
        ]
      },
      "attrs": [
        {}
      ],
      "properties": {
        "order": 12,
        "id": 6,
        "name": "Leadership",
        "prevSize": 32,
        "code": 59657
      },
      "setIdx": 0,
      "setId": 2,
      "iconIdx": 9
    },
    {
      "icon": {
        "paths": [
          "M116.482 449.208l-53.436 216.736 216.719 53.436 53.428-216.736-216.711-53.436zM278.962 651.715l-179.028-44.155 33.104-134.283 179.036 44.155-33.112 134.283z",
          "M126.362 591.593l31.99-23.364 8.88 14.688 38.765-20.431 4.481 22.356 42.828-41.918 7.324 81.773z",
          "M181.977 526.139c0 9.383-7.607 16.99-16.99 16.99s-16.99-7.607-16.99-16.99c0-9.383 7.607-16.99 16.99-16.99s16.99 7.607 16.99 16.99z",
          "M80.437 680.231l7.586 35.152 72.024-15.532z",
          "M77.939 565.035l-11.543-53.494 26.108-5.612 5.169-20.972-56.713 12.231 25.051 116.179z",
          "M264.7 475.75l-5.538-25.616-52.503 11.313z",
          "M217.096 162.554c0 9.153-7.42 16.572-16.572 16.572s-16.572-7.42-16.572-16.572c0-9.153 7.42-16.572 16.572-16.572s16.572 7.42 16.572 16.572z",
          "M260.293 162.554c0 9.148-7.416 16.564-16.564 16.564s-16.564-7.416-16.564-16.564c0-9.148 7.416-16.564 16.564-16.564s16.564 7.416 16.564 16.564z",
          "M303.505 162.554c0 9.153-7.42 16.572-16.572 16.572s-16.572-7.42-16.572-16.572c0-9.153 7.42-16.572 16.572-16.572s16.572 7.42 16.572 16.572z",
          "M117.703 99.82v324.084l21.316 5.259v-308.044h617.914v541.819h-437.641l-5.251 21.299h464.2v-584.417z",
          "M183.943 217.096v223.142l1.466 0.36 92.807-20.005 9.781 45.302 75.284 18.563-31.719 128.672h380.428v-396.034h-528.048zM447.98 452.026l-63.93 36.897v-147.62l127.853 73.81-63.922 36.913z"
        ],
        "attrs": [
          {},
          {},
          {},
          {},
          {},
          {},
          {},
          {},
          {},
          {},
          {}
        ],
        "width": 819,
        "isMulticolor": false,
        "isMulticolor2": false,
        "grid": 0,
        "tags": [
          "Media"
        ]
      },
      "attrs": [
        {},
        {},
        {},
        {},
        {},
        {},
        {},
        {},
        {},
        {},
        {}
      ],
      "properties": {
        "order": 13,
        "id": 5,
        "name": "Media",
        "prevSize": 32,
        "code": 59658
      },
      "setIdx": 0,
      "setId": 2,
      "iconIdx": 10
    },
    {
      "icon": {
        "paths": [
          "M217.6 335.076v396.8h384v-396.8zM326.4 437.476h166.4c10.637 0 19.2 8.561 19.2 19.2v153.6c0 10.637-8.563 19.2-19.2 19.2h-166.4c-10.637 0-19.2-8.563-19.2-19.2v-153.6c0-10.639 8.563-19.2 19.2-19.2z",
          "M678.699 315.876v-89.6h-537.6v89.6z",
          "M362.949 4.127c-7.603 0-15.173 2.924-21 8.748l-21.048 21.051c-8.876 8.873-10.89 21.814-6.252 32.65l-65.050 71.549v68.951h25.6v-59.049l58.949-64.85c9.964 2.737 20.943 0.666 28.8-7.201l21.051-21.051c11.653-11.651 11.656-30.397 0-42.048-5.827-5.827-13.448-8.75-21.051-8.75z",
          "M115.2 815.076v-64h588.8v64z"
        ],
        "attrs": [
          {},
          {},
          {},
          {}
        ],
        "width": 819,
        "isMulticolor": false,
        "isMulticolor2": false,
        "grid": 0,
        "tags": [
          "Model_UN"
        ]
      },
      "attrs": [
        {},
        {},
        {},
        {}
      ],
      "properties": {
        "order": 14,
        "id": 4,
        "name": "Model_UN",
        "prevSize": 32,
        "code": 59659
      },
      "setIdx": 0,
      "setId": 2,
      "iconIdx": 11
    },
    {
      "icon": {
        "paths": [
          "M454.468 409.6c0 24.78-20.088 44.868-44.868 44.868s-44.868-20.088-44.868-44.868c0-24.78 20.088-44.868 44.868-44.868s44.868 20.088 44.868 44.868z",
          "M624.321 409.592c15.27-13.681 29.188-27.378 41.419-40.911 50.7-56.082 67.617-102.859 48.906-135.258-8.675-15.016-29.196-32.915-77.75-32.915-32.883 0-74.301 8.307-119.89 23.257-4.219-20.12-9.134-39.068-14.746-56.459-23.208-71.934-55.255-109.961-92.66-109.961-37.421 0-69.46 38.027-92.668 109.978-5.612 17.392-10.527 36.34-14.737 56.459-45.588-14.959-87.015-23.257-119.89-23.257-48.546 0-69.075 17.9-77.742 32.915-18.719 32.408-1.802 79.176 48.898 135.258 12.231 13.533 26.141 27.23 41.402 40.911-15.262 13.681-29.18 27.378-41.402 40.903-50.7 56.082-67.609 102.851-48.898 135.242 8.675 15.016 29.196 32.932 77.75 32.932 32.883 0 74.293-8.307 119.882-23.265 4.227 20.12 9.134 39.068 14.746 56.467 23.208 71.934 55.247 109.969 92.66 109.969 37.405 0 69.452-38.035 92.66-109.986 5.612-17.4 10.527-36.348 14.746-56.467 45.588 14.95 87.007 23.257 119.874 23.257 0.008 0 0.008 0 0.008 0 48.546 0 69.083-17.908 77.758-32.932 18.702-32.399 1.786-79.167-48.906-135.242-12.231-13.517-26.149-27.214-41.419-40.894zM182.305 584.638c-25.207 0-42.353-5.652-48.275-15.917-7.84-13.566-0.213-45.744 44.671-95.396 12.354-13.672 26.583-27.558 42.287-41.443 20.242 16.482 42.328 32.784 65.855 48.595 1.925 28.271 4.997 55.542 9.15 81.306-43.631 14.688-82.96 22.856-113.689 22.856zM284.844 437.748c-13.033-9.282-25.534-18.686-37.364-28.156 11.829-9.462 24.322-18.874 37.364-28.156-0.246 9.322-0.393 18.711-0.393 28.164-0.008 9.454 0.147 18.825 0.393 28.148zM286.843 338.715c-23.527 15.811-45.605 32.113-65.855 48.595-15.696-13.877-29.925-27.763-42.287-41.443-44.884-49.66-52.511-81.846-44.671-95.412 5.923-10.256 23.069-15.901 48.275-15.901 30.728 0 70.066 8.167 113.68 22.847-4.145 25.764-7.217 53.035-9.142 81.314zM496.402 315.654c-7.954-4.882-16.015-9.716-24.207-14.442-8.167-4.719-16.359-9.249-24.543-13.689 14.59-6.66 28.975-12.771 43.049-18.276 2.245 14.672 4.162 30.155 5.702 46.408zM409.6 91.374c24.977 0 56.435 52.183 75.096 143.819-24.379 9.273-49.603 20.234-75.104 32.702-25.502-12.46-50.717-23.429-75.088-32.694 18.661-91.644 50.119-143.827 75.096-143.827zM328.507 269.246c14.066 5.505 28.451 11.616 43.041 18.276-8.192 4.44-16.376 8.97-24.543 13.689-8.192 4.727-16.245 9.56-24.199 14.434 1.54-16.253 3.457-31.728 5.702-46.399zM322.806 503.546c7.946 4.874 16.007 9.708 24.199 14.434 8.167 4.719 16.359 9.241 24.543 13.681-14.59 6.66-28.967 12.763-43.041 18.268-2.245-14.664-4.162-30.138-5.702-46.383zM409.6 727.826c-24.986 0-56.443-52.191-75.104-143.835 24.379-9.273 49.594-20.242 75.096-32.702 25.51 12.46 50.733 23.429 75.104 32.702-18.653 91.644-50.119 143.835-75.096 143.835zM490.709 549.945c-14.082-5.505-28.467-11.616-43.057-18.276 8.184-4.44 16.376-8.97 24.543-13.681 8.192-4.735 16.253-9.56 24.207-14.442-1.54 16.245-3.457 31.719-5.693 46.399zM499.45 461.423c-14.295 9.249-29.065 18.309-44.278 27.091-15.196 8.774-30.433 16.99-45.572 24.732-15.147-7.741-30.376-15.958-45.572-24.732-15.204-8.782-29.975-17.834-44.27-27.083-0.827-16.63-1.278-33.907-1.278-51.831s0.451-35.209 1.278-51.839c14.295-9.241 29.057-18.301 44.27-27.083 15.196-8.774 30.425-16.998 45.58-24.74 15.147 7.741 30.368 15.958 45.564 24.74 15.532 8.97 30.278 18.006 44.27 27.042 0.827 16.646 1.278 33.939 1.278 51.88 0.008 17.924-0.451 35.193-1.27 51.823zM636.895 234.553c25.207 0 42.353 5.644 48.275 15.901 7.84 13.566 0.213 45.752-44.679 95.404-12.37 13.681-26.591 27.566-42.303 41.443-20.234-16.474-42.312-32.776-65.831-48.579-1.925-28.279-5.005-55.55-9.159-81.33 43.631-14.672 82.969-22.839 113.697-22.839zM534.364 381.403c13.312 9.478 25.772 18.891 37.38 28.172-11.837 9.47-24.338 18.874-37.38 28.164 0.246-9.322 0.401-18.694 0.401-28.148-0-9.462-0.164-18.858-0.401-28.189zM685.171 568.721c-5.923 10.265-23.069 15.917-48.284 15.917 0 0 0 0-0.008 0-30.72 0-70.050-8.167-113.664-22.856 4.153-25.772 7.234-53.043 9.159-81.314 23.544-15.819 45.638-32.137 65.888-48.636 69.96 61.956 99.394 115.261 86.909 136.888z"
        ],
        "attrs": [
          {},
          {}
        ],
        "width": 819,
        "isMulticolor": false,
        "isMulticolor2": false,
        "grid": 0,
        "tags": [
          "Science_&_Technology"
        ]
      },
      "attrs": [
        {},
        {}
      ],
      "properties": {
        "order": 15,
        "id": 3,
        "name": "Science_n_Technology",
        "prevSize": 32,
        "code": 59660
      },
      "setIdx": 0,
      "setId": 2,
      "iconIdx": 12
    },
    {
      "icon": {
        "paths": [
          "M87.4 477.3c-0.3 0-0.6 0-0.9-0.1-3.6-0.4-6.5-3.1-7.1-6.6-14.5-78.5-0.6-159.8 39.3-228.9 29.5-51.1 72-93.6 123-122.9 1.9-1.1 4.1-1.4 6.2-0.8 58.5 15.7 108.6 52.8 141 104.5 1.4 2.3 1.6 5.1 0.6 7.5-1 2.5-3.2 4.3-5.8 4.8-128.6 27.6-236.6 116.4-288.8 237.5-1.3 3-4.2 5-7.5 5zM247 134.7c-47.2 27.9-86.6 67.6-114 115.2-33.4 57.9-47.7 124.7-41.2 190.9 26-50.9 62.3-96.5 106.1-133.1 49.3-41.2 108.1-70.9 170.8-86.2-29.6-42.2-72.3-72.8-121.7-86.8z",
          "M245.8 701.6c-1.6 0-3.1-0.5-4.3-1.3-85.1-49.2-144.1-132.9-162-229.8-0.3-1.6-0.1-3.2 0.5-4.7 26.3-61 67.1-115.7 117.9-158.2 52.4-43.8 115.4-74.5 182.4-88.9 3.4-0.7 6.8 0.7 8.7 3.7 17.3 27.7 28.7 57.9 33.8 89.9 5.3 33.2 3.6 66.6-5.2 99.3-0.8 3-3.2 5.2-6.1 5.9-57.5 15.5-105.6 52.4-135.4 104-29.9 51.7-37.8 111.9-22.3 169.6 0.2 0.7 0.3 1.4 0.3 2.1-0.1 4.7-3.8 8.4-8.3 8.4zM95.9 470c16.4 84.9 66 158.9 137.6 206.2-10.2-55.9-0.4-113 28.3-162.7 31.2-54.2 81.2-93.2 141.1-110.5 14.1-57.1 5.3-116-24.8-166.9-125.4 28.8-230.4 115.8-282.2 233.9zM409.6 409.6v0 0z",
          "M581.8 485.3c-2.6 0-5-1.2-6.5-3.3-1.6-2.1-2.1-4.9-1.3-7.5 40.4-125.2 17.5-263-61.3-368.8-2.2-2.9-2.2-6.9 0-9.8 2.1-2.9 5.9-4.1 9.3-2.9 75.2 26.7 138.6 79.4 178.5 148.5 29.5 51 45 109.1 45 168 0 2.2-0.9 4.3-2.4 5.8-42.9 42.8-100.1 67.6-161 69.8-0.1 0.2-0.2 0.2-0.3 0.2zM541.6 118.7c31.1 48 52.4 102.2 62.2 158.5 11 63.3 7.3 129.1-10.7 191 51.3-4.5 99.1-26.2 136-61.9-0.5-54.8-15.3-108.8-42.8-156.4-33.4-57.9-84.2-103.7-144.7-131.2zM737.3 409.6v0 0z",
          "M573.2 485.4c-29.6 0-58.4-5.3-85.9-15.8-31.4-12-59.5-30.2-83.4-54.2-2.2-2.2-2.9-5.4-2-8.3 15.3-57.6 7.4-117.6-22.4-169.2-29.8-51.7-78-88.6-135.6-104.1-2.9-0.7-5.2-3-6-6-0.7-2.9 0.2-5.8 2.2-7.8 0.5-0.5 1-0.9 1.6-1.2 85.1-49.3 187.3-58.6 280.2-25.6 1.5 0.5 2.9 1.5 3.8 2.8 39.7 53.2 66.6 115.9 78 181.2 11.7 67.2 6.8 137.2-14.2 202.4-1.1 3.3-4.1 5.5-7.5 5.7-2.9 0.1-5.9 0.1-8.8 0.1zM418.7 407.1c42.4 40.7 97.8 62.6 157 61.9 37.7-122.9 14.9-257.3-61.6-361.2-81.7-28.2-170.7-22.3-247.4 16 53.5 19.1 98.1 56.1 126.8 105.9 31.3 54.1 40.2 116.9 25.2 177.4z",
          "M409.5 745.5c-58.9 0-116.9-15.6-167.9-45-1.9-1.1-3.3-2.9-3.8-5-15.7-58.5-8.5-120.5 20-174.3 1.3-2.4 3.6-4 6.2-4.3s5.3 0.7 7.1 2.6c88.2 97.6 219.1 146.7 350.1 131.3 3.6-0.4 7 1.6 8.5 4.9 1.4 3.3 0.6 7.2-2.2 9.5-60.7 51.8-138.1 80.4-217.8 80.4-0.1-0.1-0.2-0.1-0.2-0.1zM252.7 687.9c47.8 26.9 101.9 41.2 156.8 41.2 0 0 0.1 0 0.1 0 66.8 0 131.8-21.1 185.9-59.8-57.1 2.9-114.7-5.7-168.4-25.4-60.4-22.1-115.5-58.2-160.1-104.8-21.7 46.7-26.8 99-14.3 148.8z",
          "M573.8 669.9c-49.9 0-99.9-8.8-146.7-25.9-64.1-23.5-122.2-62.7-168.2-113.5-2.3-2.6-2.8-6.3-1.2-9.3 15.3-28.8 35.8-53.8 61-74.2 26.1-21.2 55.9-36.4 88.6-45.2 3.1-0.8 6.2 0.2 8.2 2.5 87.1 86.7 228.4 86.7 315.5 0 2.4-2.7 6.4-3.6 9.8-1.8 2.9 1.5 4.5 4.4 4.5 7.5-0.1 98.3-43.1 191.4-118 255.3-1.2 1.1-2.8 1.7-4.4 1.9-16.1 1.7-32.6 2.7-49.1 2.7zM275 523.7c87.6 94.1 215.5 141.5 343.7 127.3 65.3-56.6 104.6-136.6 109.8-222.2-43.3 36.8-97.7 56.8-155.1 56.8 0 0 0 0 0 0-62.5 0-121.3-23.7-166.2-66.9-56.6 16.5-103.2 53.5-132.2 105z"
        ],
        "attrs": [
          {},
          {},
          {},
          {},
          {},
          {}
        ],
        "width": 819,
        "isMulticolor": false,
        "isMulticolor2": false,
        "grid": 0,
        "tags": [
          "Sports"
        ]
      },
      "attrs": [
        {},
        {},
        {},
        {},
        {},
        {}
      ],
      "properties": {
        "order": 16,
        "id": 2,
        "name": "Sports",
        "prevSize": 32,
        "code": 59661
      },
      "setIdx": 0,
      "setId": 2,
      "iconIdx": 13
    },
    {
      "icon": {
        "paths": [
          "M510.771 549.274h104.858v-15.565l-32.358-16.384v-76.186l92.57 18.842v-22.528l-92.57-47.104 0.41-61.85c0-13.517-9.421-27.034-20.48-33.997-11.059 6.963-20.48 20.48-20.48 33.997l0.41 61.85-92.57 47.104v22.528l92.57-18.842v76.186l-32.358 16.384zM102.4 655.36h614.4c20.48 0 20.48 0 20.48-20.48v-409.6c0-20.48 0-20.48-20.48-20.48h-286.72c-55.296-53.248-168.755-81.92-286.31-81.92v81.92h-41.37c-20.48 0-20.48 0-20.48 20.48v409.6c0 20.48 0 20.48 20.48 20.48zM389.12 609.894c-45.466-21.709-128.205-36.454-204.39-39.731v-405.504c79.053 4.506 163.021 25.805 204.39 56.525zM430.080 614.4v-368.64h266.24v368.64zM430.080 614.4z"
        ],
        "attrs": [
          {}
        ],
        "width": 819,
        "isMulticolor": false,
        "isMulticolor2": false,
        "grid": 0,
        "tags": [
          "Tourism"
        ]
      },
      "attrs": [
        {}
      ],
      "properties": {
        "order": 17,
        "id": 1,
        "name": "Tourism",
        "prevSize": 32,
        "code": 59662
      },
      "setIdx": 0,
      "setId": 2,
      "iconIdx": 14
    },
    {
      "icon": {
        "paths": [
          "M292.236 445.448c-1.409 3.594-0.907 5.647-0.907 5.647l1.846 26.662c-0.918 36.482-16.886 48.409-16.886 48.409l22.588 145.326c-25.69-9.251-49.775-21.649-71.806-36.656l-9.393-104.858c0 0-5.046-2.545-15.084-7.165-10.016-4.609-20.513-17.564-23.189-21.998-2.621-4.446-8.826-16.876-23.91-28.257-15.051-11.392-16.504-5.953-20.48-12.867-3.998-6.892 6.018-11.239 6.018-11.239s27.831-5.429 51.347 23.91c0 0 0.71-0.186 1.977-0.36l0.328-1.114c-0.284 0.033-0.448 0.033-0.448 0.033 0.153-0.022 0.295-0.033 0.459-0.044l1.409-4.751c0 0 0.055-0.743 0.131-1.922 7.515-0.153 34.778 1.049 46.279 25.439 0.721 1.158 1.453 2.337 2.163 3.594 0 0-2.163-34.177-48.431-29.12 0.229-3.681 0.644-11.48 0.208-15.193-0.59-4.937-2.731-9.688-2.731-9.688l-23.833-56.197c0 0-4.544-9.47 3.888-13.905 8.421-4.435 13.020 3.2 13.020 3.2s25.253 50.474 28.104 56.721c2.851 6.237 6.652-1.824 6.652-1.824l-9.099-67.447c0 0-2.621-11.021 9.208-13.489 11.829-2.447 12.867 15.084 12.867 15.084s7.963 58.065 9.033 64.804c1.081 6.728 4.773 0.229 4.773 0.229s8.902-55.848 9.765-61.757c0.896-5.92 2.731-12.463 11.469-12.179 8.738 0.273 7.537 19.115 7.537 19.115s-6.674 56.678-6.969 60.927c-0.284 4.26 2.501 3.135 2.501 3.135s21.157-43.625 22.883-46.727c1.748-3.124 5.145-9.863 13.73-6.39 8.574 3.452 0.055 22.402 0.055 22.402s-15.641 36.94-17.072 40.512zM679.27 415.848c-7.253-4.97-11.796 0.601-14.036 3.102-2.239 2.523-30.747 38.71-30.747 38.71s-2.807 0.459-1.671-3.408c1.136-3.888 18.885-55.083 18.885-55.083s4.937-17.258-3.091-19.311-11.076 3.659-13.129 8.957c-1.977 5.287-21.627 55.291-21.627 55.291s-4.784 5.287-4.369-1.147c0.371-6.466 4.817-61.975 4.817-61.975s2.621-16.471-8.858-16.613c-11.502-0.12-11.261 10.639-11.261 10.639l-5.341 64.411c0 0-5.188 6.717-6.554 0.35-1.365-6.39-14.505-58.36-14.505-58.36s-2.687-8.039-11.414-5.636c-8.727 2.392-6.444 12.102-6.444 12.102l10.65 56.984c0 0 1.027 4.828 0.568 9.535-0.339 3.452-2.228 10.322-3.222 13.784 42.369 5.297 37.552 36.678 37.552 36.678-0.404-1.322-0.852-2.578-1.3-3.812-5.352-23.451-27.831-30.747-36.307-32.692-0.328 1.158-0.557 1.911-0.557 1.911l-2.283 4.118c-0.164-0.022-0.284-0.033-0.47-0.055 0 0 0.186 0.022 0.47 0.066l-0.535 0.972c-1.212-0.087-1.922-0.076-1.922-0.076-15.827-32.025-42.74-32.659-42.74-32.659s-10.202 2.010-7.908 9.208c2.283 7.242 4.762 2.501 16.406 16.122 11.665 13.631 14.888 26.433 16.428 31.086 1.562 4.653 8.651 18.842 17.028 25.133 8.356 6.324 12.517 9.732 12.517 9.732l-16.111 126.048c24.030-11.294 46.323-25.461 66.475-41.998l4.73-75.639c0 0 17.247-7.788 25.537-41.452l3.714-25.1c0 0-0.044-2.010 2.021-5.046 2.043-3.047 24.084-34.101 24.084-34.101s11.786-15.827 4.522-20.775zM561.065 216.553c-13.195-7.231-20.010 2.982-23.429 7.668-3.408 4.675-45.974 71.085-45.974 71.085s-4.697 1.278-3.408-5.527c1.267-6.827 22.981-97.070 22.981-97.070s5.527-30.212-8.509-32.353c-14.036-2.119-18.306 8.094-20.851 17.465-2.556 9.361-27.667 97.9-27.667 97.9s-7.242 9.798-7.657-1.278-2.119-106.42-2.119-106.42 1.704-28.53-17.891-26.826c-19.584 1.704-17.454 20.021-17.454 20.021l1.693 110.668c0 0-7.668 12.332-11.076 1.704-3.397-10.65-34.472-97.059-34.472-97.059s-5.964-13.206-20.436-7.668c-14.473 5.538-8.946 21.714-8.946 21.714l27.678 95.355c0 0 2.545 8.094 2.545 16.166 0 8.094-3.834 27.678-3.834 27.678l-0.382 0.885c75.443 0.885 72.33 56.339 72.33 56.339-0.896-2.13-1.802-4.118-2.753-6.106-13.73-41.419-57.126-48.802-69.643-50.080l-2.742 6.357c-0.262 0-0.502-0.011-0.765-0.011 0 0 0.262 0.011 0.754 0.044l-0.754 1.737c-2.075 0.066-3.266 0.218-3.266 0.218-32.331-51.948-78.316-48.54-78.316-48.54s-17.028 5.112-11.884 17.028c5.112 11.917 8.509 3.419 30.649 24.685 22.129 21.288 29.797 42.577 33.205 50.233 3.408 7.679 17.88 30.66 33.205 40.010 15.303 9.372 22.981 14.483 22.981 14.483l-7.34 252.084c10.551 1.027 21.256 1.562 32.091 1.562 27.307 0 53.816-3.342 79.091-9.601l-8.498-238.933c0 0 28.104-16.166 36.613-74.919l2.119-43.429c0 0-0.415-3.408 2.534-8.946 2.993-5.516 35.335-62.139 35.335-62.139s17.443-28.945 4.26-36.187z"
        ],
        "attrs": [
          {}
        ],
        "width": 819,
        "isMulticolor": false,
        "isMulticolor2": false,
        "grid": 0,
        "tags": [
          "Volunteerism_Community_Development"
        ]
      },
      "attrs": [
        {}
      ],
      "properties": {
        "order": 18,
        "id": 0,
        "name": "Volunteerism_Community_Development",
        "prevSize": 32,
        "code": 59663
      },
      "setIdx": 0,
      "setId": 2,
      "iconIdx": 15
    }
  ],
  "height": 1024,
  "metadata": {
    "name": "icomoon"
  },
  "preferences": {
    "showGlyphs": true,
    "showQuickUse": true,
    "showQuickUse2": true,
    "showSVGs": true,
    "fontPref": {
      "prefix": "icon-",
      "metadata": {
        "fontFamily": "icomoon",
        "majorVersion": 1,
        "minorVersion": 0
      },
      "metrics": {
        "emSize": 1024,
        "baseline": 6.25,
        "whitespace": 50
      },
      "embed": false
    },
    "imagePref": {
      "prefix": "icon-",
      "png": true,
      "useClassSelector": true,
      "color": 0,
      "bgColor": 16777215,
      "classSelector": ".icon"
    },
    "historySize": 100,
    "showCodes": true,
    "gridSize": 16,
    "showLiga": true
  }
}