ID,STUDENT,FATHER,MOTHER,MOBILE,DEPARTMENT,SESSION,SEMESTER
2.0151E+12,Md. Istekhar Reza Shrabon,Md. Shamim Reza ,Most. Ismetara Reza,01625-081433,B.BCBT,Spring- 2015,2nd
2.0151E+12,Al Amin,Shamsul Islam,Saleha Khatun,01755-358125,B.BCBT,Spring- 2015,2nd
2.01511E+12,Kazi Emon,Kazi Habibur Rahman,Tarana Sharmin Parni,01711-376591,CSE,Fall 2015,1st
2.01511E+12,Mst. Humayra Yesmin Ava,Mr. Hafizur Rahman,Mrs. Nurunnaher Hafiz,01716-391072,CSE,Fall 2015,1st
2.01511E+12,Md. Ziaur Rahman,Md. Abdul Hamid Shekh,Sukzan Begum,01773-947121,CSE,Fall 2015,1st
2.01511E+12,Md. Mehedi Hasan,Mohammad Ali Zinnah,Hosneara Khatun,01755-855543,CSE,Fall 2015,1st
2.01511E+12,Mst. Maksuda Jerin,Md. Mokaddes Hossain,Mst. Hena Khatun,01754-330629,CSE,Fall 2015,1st
2.01511E+12,Md. Saiful Islam,Md. Abu Sayeed Pk,Bulbuli Begum,1731893984,EEE,Fall 2015,1st
2.01511E+12,Asheak - E - Rabbi,H.S. Nazrul Islam,Most. Rozina Khatun Mina,1913005529,EEE,Fall 2015,1st
2.01511E+12,Md. Ohidul Islam,Md. Lutfor Rahman,Mst. Shahinnr Khatun,1790524099,EEE,Fall 2015,1st
2.01511E+12,Md. Masud Rana Sohag,Md. Lutfar Rahman ,Mst. Ruzi Akter,1740068400,EEE,Fall 2015,1st
2.01511E+12,Md. Moniruzzaman,Md. Anisur Rahman,Rubia Begum,1744783138,EEE,Fall 2015,1st
2.01511E+12,Md. Yousuf Ali,Late Moydan Ali,Jamila Bawa,1738253254,EEE,Fall 2015,1st
2.0151E+12,Most. Farhana Alam Bhadhon,Md. Bahar Alam,Mrs. Fohara Alam,1792241812,B.in English,Fall 2015,6th
2.0151E+12,Most. Sumi Khatun,Md. Shafiul Alam,Mst. Satara Khatun,1626214407,B.in English,Fall 2015,6th
2.0151E+12,Md. Al- Amin Sarker,Md. Zuran Sarkar,Mst. Mina Khatun,1737850930,B.in English,Fall 2015,6th
2.0151E+12,Md. Iftekar Hasan,Md. Abdus Salam,Ismotara,1770911963,B.in English,Fall 2015,6th
2.0151E+12,Abdul Barik,Nur Mohammad Ali,Angora Khatun,1785463797,B.in English,Fall 2015,6th
2.0151E+12,Md. Abdul Quader,Md. Sontesh Ali,Rizia Begum,1739981046,B.in English,Fall 2015,6th
2.0151E+12,Silvia Shakawat,Shakawat Hossion,Anju Ara Begum,1713026125,B.in English,Fall 2015,6th
2.0151E+12,Md. Monnaf Ali,Md. Yousuf Ali,Mst. Ayesha Khatun,1738032277,B.in English,Fall 2015,6th
