0e226c81-f4d3-4a95-84dd-4a677329d0f2 ACKNOWLEDGED WARNING PERFORMANCE 000297900458 000297900458 Symmetrix Jan-14-2020 19:07:53.572 1579009073572 Aggregation failed to run for Symmetrix 000297900458 within last 24 hours. true
This XML file does not appear to have any style information associated with it. The document tree is shown below.
<ns12:alert>
<ns12:alertId>0e226c81-f4d3-4a95-84dd-4a677329d0f2</ns12:alertId>
<ns12:state>ACKNOWLEDGED</ns12:state>
<ns12:severity>WARNING</ns12:severity>
<ns12:type>PERFORMANCE</ns12:type>
<ns12:array>000297900458</ns12:array>
<ns12:object>000297900458</ns12:object>
<ns12:object_type>Symmetrix</ns12:object_type>
<ns12:created_date>Jan-14-2020 19:07:53.572</ns12:created_date>
<ns12:created_date_milliseconds>1579009073572</ns12:created_date_milliseconds>
<ns12:description>
Aggregation failed to run for Symmetrix 000297900458 within last 24 hours.
</ns12:description>
<ns12:description>...</ns12:description>
<ns12:acknowledged>true</ns12:acknowledged>
</ns12:alert>