,Text,Target
0,Logging in with 'Remember my Login' deselected gives: Use of uninitialized value in string eq at Bugzilla/Auth/Login/WWW/CGI.pm line 83,minor
1,"a spelling's mistake Spelling mistake in docs, section ""Searching for Bugs""",trivial
2,[RFE] Unsubscribe from bug you've reported Unsubscribe from bug you've reported,normal
3,"LDAP Authentication: if LDAPbinddn is defined, re-bind as that user before searching",trivial
4,'Boundary' line removed from multipart message header in newchangedmail,minor
5,New charts feature crashes [PostgreSQL] New charts feature crashes,normal
6,"Invalid Column Name when exportign bug list to CVS ""Invalid Column Name"" when exportign bug list to CSV ""Invalid Column Name"" when exporting bug list to CSV ""Invalid Column Name"" when exporting bug list to non-HTML format",major
7,Make the group name an edit link,trivial
8,The login form on the Bugzilla home page may redirect your login and password to another site [SECURITY] The login form on the Bugzilla home page may redirect your login and password to another site,normal
9,"changing a bug generates multiple ""Bug Processed""",normal
