{
  "Data Diagnostic": {
    "Class Distribution": {"img_path": "./Results/DataDiagnostic/MetaData/class_distribution_plot.png"},
    "Train Validation Test": {
      "Train Validation Test Ratio": {
        "train_ratio": 0.7, "val_ratio": 0.2, "test_ratio": 0.1
      },
      "Train Validation Test Size": {
        "n_datapoints_train": 60990, "n_datapoints_val": 17426, "n_datapoints_test": 8713
      }
    },
    "Outlier Duplicate Meta Info": {
      "Duplicate": {
        "n_duplicate": 12191, "n_duplicate_percent": 0.122
      },
      "Outlier": {
        "n_outlier": 680, "n_outlier_percent": 0.008
      }
    },
    "Head of Text Data": [{"Text": "These are made in China (do not buy ANY pet food from China).  Dogswell has been using propylene glycol to soften their treats (what are they thinkng?).  Do not purchase or support this company in any way until they clean up their act.  And for whatever reason Amazon doesn't allow returns of this item, so I had to toss mine out.  Bad business all around on this one.", "Target": 1}, {"Text": "Everything is ok, except it just isn't as good as it is in the bags.  Just considerably more bland -- less lemon and less zing.  Boring.", "Target": 3}, {"Text": "Best cat treat ever. There isn't anything comparable to the love my cat has for these treats, he snubs away any other kind now.<br />I know he likes to manipulate me with his cattiness but these treats are my way of manipulating him to come sit on my lap and have some chill time. :)", "Target": 5}, {"Text": "My two Corgis were thoroughly spoiled by my late husband (I spent a year and a half dieting them down a combined total of 25 pounds!)<br /><br />They are accustomed to the finest of fare, and they absolutely love the Wellness brand of treats.", "Target": 5}, {"Text": "We used to have drive down to the specialty pet food store for this product.  So glad we discovered Amazon.  As far as I can tell it is no more expensive & in some cases less - Prime membership is awesome.  Loving Pets treats are some of the best according to my dog.  They do not develop that nasty smell like some dog treats do.", "Target": 5}, {"Text": "I really liked this coffee, it was just as good as everyone claimed it was.  Strong, bold and flavorful!  I would recommend!", "Target": 5}, {"Text": "I am always looking for healthier, whole grain versions of foods I enjoy.  Unfortunately, these Peacock brand noodles are yet another food masquerading as healthy.  The product title in big letters on the front says \"Brown Rice Vermicelli\", making the consumer think \"this is made with brown rice, so it should be a healthy choice\".  But the first indication that it is not is when looking at the fiber content on the nutrition facts - only 0.6g per 2oz serving.  Then onto the ingredients list to see why so low... contains brown rice, sago starch and water.  The sago starch comes from palms and must not have much (if any) fiber.<br /><br />The Annie Chun's Maifun Brown Rice Noodles (sold on Amazon and in my local healthy grocer) has become one of my staples and is my frame of reference when comparing to the Peacock brand.  The Annie Chun's product is made with 100% whole grain, with ingredients brown rice flour and water.  Per 2oz serving, it has 4g fiber and pretty much the same calories and other nutrients as the Peacock brand.<br /><br />If you do try this Peacock brand noodles and have not used rice noodles before, you will need to seek guidance elsewhere on preparation.  As others have pointed out, the Peacock package gives almost no directions on how to prepare the product, aside from a brief mention in the recipes (in the header text it does say that they are \"easy-to-cook\" but does not say how).  It also contains a very strange recipe for rice noodles: Aglio Olio style - this is an Italian recipe for noodles with olive oil/garlic/sprinkled with grated cheese that I think would not be very tasty.  The second recipe appears to be for a soup with veggie strips.  Neither recipe gives amounts or much direction.  In comparison, the Annie Chun's package gives clear, specific directions on rice noodle preparation and two recipes.<br /><br />I use rice noodles = maifun = rice sticks = sometimes called vermicelli for making the Vietnamese salad \"bun tofu\", to serve with stir-fried veggies or in lettuce rolls.  They can also be used in spring rolls/egg rolls.  When cooking with thin rice noodles, be careful not to oversoak/overcook/overmix or they tend to disintegrate.  Asian rice noodle vermicelli (maifun) are not the same as Italian vermicelli and are not readily interchangeable.  If making an Italian recipe, the best results would be expected from Italian pasta and not maifun.<br /><br />A few final notes...  Both Peacock and Annie Chun's brown rice noodles are gluten free.  The Peacock is made in Singapore and the Annie Chun's in Thailand.  The Peacock noodles do taste fine (kind of bland), but so do the Annie Chun's.  At this time, they are both approximately the same price.  Peacock come in an plastic bag with some noodle crushage upon shipping; Annie Chun's are perfect upon removal from their cellophane bag in a box.  Overall, I highly recommend the Annie Chun's Maifun as a healthier option over the Peacock brand.  On a related note, the Annie Chun's soba and brown rice pad thai noodles are also excellent.<br /><br />Rating for this product: 2.5 stars rounded down to 2 stars.", "Target": 2}, {"Text": "I have tried many different drink mix, this is the best tasting by far. It does not have the after taste of the sweetener and I really like it, it is pretty strong, so I use a big water bottle (20 oz) for one tube, it still a little stronger than I like, but it is just my taste.", "Target": 5}, {"Text": "This is my favorite item to order for my Keurig. There are so many flavors, my finicky palate never gets bored!  The only downside is there are probably 5-6 decaf varieties.  I don't drink decaf (I REQUIRE copious amounts of caffeine), so they sit on the shelf...", "Target": 5}, {"Text": "Tastes like Earl Grey, but it's green tea so it's healthier.", "Target": 5}],
    "Meta Plots": {
      "Word Cloud": {"img_path": ["./Results/DataDiagnostic/MetaData/word_cloud_after_preprocessing.png", "./Results/DataDiagnostic/MetaData/word_cloud_before_preprocessing.png"]},
      "Word Count Distribution": {"img_path": ["./Results/DataDiagnostic/MetaData/word_count_after_preprocessing.png", "./Results/DataDiagnostic/MetaData/word_count_before_preprocessing.png"]},
      "Word Frequency Unigram": {"img_path": ["./Results/DataDiagnostic/MetaData/word_frequency_unigram_after_preprocessing.png", "./Results/DataDiagnostic/MetaData/word_frequency_unigram_before_preprocessing.png"]},
      "Word Frequency Bigram": {"img_path": ["./Results/DataDiagnostic/MetaData/word_frequency_bigram_after_preprocessing.png", "./Results/DataDiagnostic/MetaData/word_frequency_bigram_before_preprocessing.png"]}
    }
    },
    "Modeling": {
      "Performance Metrics": "accuracy",
      "Train Score": 0.664,
      "Validation Score": 0.597,
      "Confusion Matrix": {"img_path": "./Results/Modeling/Model/confusion_matrix.png"}
    },
    "Model Explainability": {
      "Global Explainability": {
        "Sklearn Implicit": {
          "img_path": ["./Results/ModelExplainability/Global/SklearnFeatureImportance/logistic_regression_feature_importance_0.png", "./Results/ModelExplainability/Global/SklearnFeatureImportance/logistic_regression_feature_importance_1.png", "./Results/ModelExplainability/Global/SklearnFeatureImportance/logistic_regression_feature_importance_2.png", "./Results/ModelExplainability/Global/SklearnFeatureImportance/logistic_regression_feature_importance_3.png", "./Results/ModelExplainability/Global/SklearnFeatureImportance/logistic_regression_feature_importance_4.png"]
        },
        "SHAP Global": {
          "img_path": ["./Results/ModelExplainability/Global/ShapGlobal/shap_global_linear_feature_importance.png"]
        },
        "Decision Tree Surrogate": {
          "img_path": ["./Results/ModelExplainability/Global/DecisionTreeSurrogate/decision_tree_surrogate_feature_importance.png"]
        }
    }
    }
  }
