,target,feature,weight,value
0,1,chemical,0.7772549116401068,3.0
1,1,taste,0.31642073975429713,3.0
2,1,company,0.2954051692408974,1.0
3,1,mistake,0.2879688670980704,1.0
4,1,floor,0.27170777409136126,3.0
5,1,<BIAS>,0.22487133150248942,1.0
6,1,maybe,0.20731352205208325,1.0
7,1,garden,0.1818626156909401,3.0
8,1,smell,0.13822714912103215,1.0
9,1,immediately,0.1347751919353164,1.0
10,1,wood,0.11484955149220977,1.0
11,1,fake,0.11366410299836,2.0
12,1,hint,0.11258387185997633,1.0
13,1,corn,0.10846158284116426,1.0
14,1,product,0.1078687459832456,1.0
15,1,word,0.10425249647365954,1.0
16,1,going,0.09454679432165418,1.0
17,1,line,0.09229696907297076,1.0
18,1,got,0.09080491919725459,1.0
19,1,lime,0.08736849213526257,6.0
20,1,red,0.0843338630267989,2.0
21,1,blue,0.08332926516097029,1.0
22,1,lemon,0.0818879082920261,2.0
23,1,error,0.07489654542316068,1.0
24,1,accept,0.06810641635266303,1.0
25,1,extracted,0.054891303107596115,1.0
26,1,given,0.054706727027690735,1.0
27,1,fragrance,0.053275061914863454,1.0
28,1,produce,0.052541637447342235,1.0
29,1,contact,0.05188096151370047,1.0
30,1,example,0.04770724295367306,1.0
31,1,lab,0.038842673869257036,1.0
32,1,eatin,0.03762731365293889,3.0
33,1,strongest,0.034157061007945896,1.0
34,1,detergent,0.03332457786273824,3.0
35,1,rate,0.03244088154268415,1.0
36,1,rotting,0.032040361471776205,1.0
37,1,extract,0.02578915556178662,2.0
38,1,reminiscent,0.01984157162300988,1.0
39,1,advanced,0.016022227792579703,1.0
40,1,dumpster,0.014001707592657007,1.0
41,1,fraudulent,0.01211485763971317,1.0
42,1,want,0.009971826844772054,1.0
43,1,billion,0.005781404883498444,1.0
44,1,herring,0.004173896300986469,1.0
45,1,colon,0.0026152058114038757,1.0
46,1,egregious,0.0019333600204934466,1.0
47,1,tostitos,0.0007900698026472461,2.0
48,1,different,0.0005980225121766938,1.0
49,1,puzzling,-7.854773148232385e-06,1.0
50,1,imperative,-4.7719767002439685e-05,1.0
51,1,stripping,-0.0007202819058868149,1.0
52,1,mop,-0.0015004201634077879,1.0
53,1,sensory,-0.002456653944804423,1.0
54,1,hots,-0.002470698040470874,1.0
55,1,candy,-0.002712218645993793,1.0
56,1,cleanse,-0.002746225842003347,1.0
57,1,lemongrass,-0.00657171288886911,1.0
58,1,littered,-0.007331217264498426,1.0
59,1,waft,-0.007361295907912933,1.0
60,1,translation,-0.007622583156806968,1.0
61,1,mask,-0.008640885956622001,1.0
62,1,sucker,-0.010461131767298506,1.0
63,1,employee,-0.012081004635233063,1.0
64,1,keen,-0.012087256653195998,1.0
65,1,tea,-0.017067113395011706,1.0
66,1,unfortunate,-0.01727825342213845,2.0
67,1,pepper,-0.01743602855921826,1.0
68,1,citrus,-0.01743717262608255,1.0
69,1,scientist,-0.02019647763550034,1.0
70,1,popcorn,-0.02071182958907829,1.0
71,1,like,-0.023599509058799664,1.0
72,1,soda,-0.023854089986405702,1.0
73,1,childhood,-0.024328514837686957,1.0
74,1,component,-0.029409982344409242,1.0
75,1,criticism,-0.03271050552698831,1.0
76,1,combination,-0.03472168425132989,1.0
77,1,theater,-0.03482072334850496,1.0
78,1,tho,-0.0413844213869865,1.0
79,1,ppm,-0.049832523554673644,1.0
80,1,considering,-0.05093728510272746,1.0
81,1,source,-0.05198079587434138,1.0
82,1,make,-0.05251032616128461,1.0
83,1,say,-0.055023711210101536,1.0
84,1,using,-0.05653678632514799,1.0
85,1,user,-0.057617251632138426,1.0
86,1,used,-0.06447668058977342,1.0
87,1,palate,-0.06737969759432111,1.0
88,1,friend,-0.0700004261186918,1.0
89,1,cheapest,-0.07256622681540445,1.0
90,1,lightly,-0.07474370761862545,1.0
91,1,time,-0.08161927785014841,1.0
92,1,detect,-0.0816472821021314,2.0
93,1,natural,-0.0822922246304283,4.0
94,1,substitute,-0.08821401679292881,1.0
95,1,tell,-0.09648898767329207,1.0
96,1,cheaper,-0.09953264044955625,1.0
97,1,coat,-0.1186648746882876,1.0
98,1,use,-0.12781943757991662,1.0
99,1,really,-0.13802874528137427,1.0
100,1,big,-0.1429402881507564,1.0
101,1,lot,-0.14798092841507365,1.0
102,1,chili,-0.15165610814426814,5.0
103,1,le,-0.15589442797644001,1.0
104,1,scent,-0.18239199564733924,1.0
105,1,right,-0.18330334928569017,1.0
106,1,strong,-0.27185336807106514,1.0
107,1,chip,-0.3092223383872179,5.0
108,1,favorite,-0.3504857629399307,1.0
109,1,flavor,-0.5230690953868742,5.0
110,2,flavor,0.610170589348851,5.0
111,2,taste,0.36757664240966553,3.0
112,2,chemical,0.2827349391512401,3.0
113,2,maybe,0.21602937814705261,1.0
114,2,extract,0.18921476126397394,2.0
115,2,smell,0.12849982615762126,1.0
116,2,detect,0.1265423546494058,2.0
117,2,scent,0.11348940884155567,1.0
118,2,considering,0.10709795026664917,1.0
119,2,floor,0.10296823923491247,3.0
120,2,eatin,0.10079870044758427,3.0
121,2,ppm,0.08831951049386035,1.0
122,2,cheapest,0.08549308476603036,1.0
123,2,got,0.07492113497911787,1.0
124,2,going,0.0682980557899091,1.0
125,2,fake,0.0650173523454293,2.0
126,2,source,0.06354172124815859,1.0
127,2,natural,0.059569315173557506,4.0
128,2,unfortunate,0.057635999643905415,2.0
129,2,rate,0.05456521955840094,1.0
130,2,really,0.05247666826157921,1.0
131,2,product,0.051990652487240975,1.0
132,2,reminiscent,0.05194611836070749,1.0
133,2,say,0.048119235913443935,1.0
134,2,strong,0.04292685283350054,1.0
135,2,big,0.0380949333099519,1.0
136,2,user,0.030452080471872218,1.0
137,2,le,0.029972547429556913,1.0
138,2,immediately,0.029059140832405985,1.0
139,2,like,0.028924895151443534,1.0
140,2,littered,0.028509010786059,1.0
141,2,error,0.022348038211888653,1.0
142,2,mask,0.022207239266594004,1.0
143,2,corn,0.02206854206226293,1.0
144,2,component,0.021700308584814816,1.0
145,2,company,0.01763034564555279,1.0
146,2,translation,0.014476667304748529,1.0
147,2,given,0.01399740062164837,1.0
148,2,tho,0.013842467449945535,1.0
149,2,waft,0.008864533209245466,1.0
150,2,fragrance,0.005581360698593216,1.0
151,2,mistake,0.0013209258611671542,1.0
152,2,want,0.00016774014924756598,1.0
153,2,puzzling,-9.476791332410467e-05,1.0
154,2,imperative,-0.0009264760701774795,1.0
155,2,hots,-0.001641938612950484,1.0
156,2,stripping,-0.0020079858586250806,1.0
157,2,sucker,-0.002879762658279049,1.0
158,2,mop,-0.003814102980860432,1.0
159,2,egregious,-0.005013503028994193,1.0
160,2,tell,-0.00508651756082115,1.0
161,2,sensory,-0.005292617314528972,1.0
162,2,billion,-0.0065213659952888196,1.0
163,2,dumpster,-0.006871395373689474,1.0
164,2,employee,-0.007429051221384491,1.0
165,2,herring,-0.007757178147307372,1.0
166,2,used,-0.008789593913599096,1.0
167,2,fraudulent,-0.01124391394361602,1.0
168,2,tea,-0.01154142477202647,1.0
169,2,scientist,-0.012804805175498368,1.0
170,2,rotting,-0.014058646909133637,1.0
171,2,advanced,-0.014278726320250432,1.0
172,2,keen,-0.01531168294489924,1.0
173,2,colon,-0.017718937101631204,1.0
174,2,<BIAS>,-0.01859741769963329,1.0
175,2,palate,-0.025713170132402676,1.0
176,2,accept,-0.025916002475989155,1.0
177,2,time,-0.02660193034282012,1.0
178,2,red,-0.032103592167490605,2.0
179,2,cleanse,-0.03304544097315436,1.0
180,2,strongest,-0.03433824638949394,1.0
181,2,criticism,-0.034916567337694875,1.0
182,2,produce,-0.03733365658477201,1.0
183,2,lemongrass,-0.040853593092180694,1.0
184,2,example,-0.045730315688632006,1.0
185,2,word,-0.0458714902336932,1.0
186,2,wood,-0.04587192607935796,1.0
187,2,lot,-0.0462419444638138,1.0
188,2,candy,-0.04645001146079338,1.0
189,2,contact,-0.04867047788946637,1.0
190,2,extracted,-0.05194175828112179,1.0
191,2,detergent,-0.053154815966528234,3.0
192,2,tostitos,-0.05756593271623507,2.0
193,2,make,-0.058107247327361215,1.0
194,2,theater,-0.06438274112730484,1.0
195,2,citrus,-0.06462112236272852,1.0
196,2,different,-0.06665191294158788,1.0
197,2,chip,-0.07112425257656434,5.0
198,2,combination,-0.07357718758748624,1.0
199,2,popcorn,-0.07449257580705954,1.0
200,2,substitute,-0.0772176062064391,1.0
201,2,using,-0.08020099537606483,1.0
202,2,childhood,-0.08053673169529316,1.0
203,2,lime,-0.08174226416545366,6.0
204,2,friend,-0.08470569297384246,1.0
205,2,lab,-0.09638602088174701,1.0
206,2,garden,-0.09675819132748542,3.0
207,2,cheaper,-0.09679557744068536,1.0
208,2,use,-0.09779885172372686,1.0
209,2,line,-0.09839258480260031,1.0
210,2,blue,-0.10168886676002695,1.0
211,2,lightly,-0.11366517814260649,1.0
212,2,soda,-0.13189231068555138,1.0
213,2,chili,-0.13493465278264194,5.0
214,2,pepper,-0.14372929176704458,1.0
215,2,right,-0.14399891735533218,1.0
216,2,coat,-0.15159367319129255,1.0
217,2,favorite,-0.16620238597273834,1.0
218,2,lemon,-0.1921725936302889,2.0
219,2,hint,-0.23559130507437642,1.0
220,3,lime,0.33453792879181493,6.0
221,3,flavor,0.33049555525468566,5.0
222,3,lemon,0.21604953365091076,2.0
223,3,maybe,0.19120298192826257,1.0
224,3,chili,0.14679248760480273,5.0
225,3,rate,0.14459285260629898,1.0
226,3,taste,0.13897035811057795,3.0
227,3,different,0.13211729788063176,1.0
228,3,strong,0.1271596406703703,1.0
229,3,fake,0.12159792734267653,2.0
230,3,line,0.1153741790450187,1.0
231,3,chip,0.10532062628510824,5.0
232,3,cheaper,0.10482742742781852,1.0
233,3,palate,0.0941694363965686,1.0
234,3,want,0.08440184320476443,1.0
235,3,herring,0.06791899869068835,1.0
236,3,considering,0.0673548542407244,1.0
237,3,soda,0.06721608658876026,1.0
238,3,combination,0.0644221144242261,1.0
239,3,tho,0.06381138726798351,1.0
240,3,lot,0.0637616571924273,1.0
241,3,time,0.057130719499196535,1.0
242,3,example,0.05659811566244738,1.0
243,3,colon,0.054569478198423185,1.0
244,3,using,0.052173632602996456,1.0
245,3,citrus,0.05076658987226522,1.0
246,3,childhood,0.048559707412458596,1.0
247,3,lightly,0.04595365525576193,1.0
248,3,detergent,0.04542686560345786,3.0
249,3,going,0.04501372493471973,1.0
250,3,scent,0.040906099083054516,1.0
251,3,hint,0.039272672830367984,1.0
252,3,big,0.037247961902122435,1.0
253,3,rotting,0.034548868681048756,1.0
254,3,le,0.032442860172511946,1.0
255,3,pepper,0.0317856875601454,1.0
256,3,right,0.03092758081536402,1.0
257,3,used,0.02820241970525804,1.0
258,3,user,0.0282003596327034,1.0
259,3,criticism,0.024271392020476606,1.0
260,3,really,0.022995840297936172,1.0
261,3,mask,0.01835392900901804,1.0
262,3,advanced,0.017443980321182984,1.0
263,3,like,0.01657345397960897,1.0
264,3,unfortunate,0.016573406592685174,2.0
265,3,extracted,0.016047649401177668,1.0
266,3,product,0.01499947492260727,1.0
267,3,lab,0.01364980431504068,1.0
268,3,egregious,0.013584635393098102,1.0
269,3,tostitos,0.013515598879564597,2.0
270,3,blue,0.010474362620168416,1.0
271,3,contact,0.009913318077687468,1.0
272,3,lemongrass,0.009584826513691667,1.0
273,3,component,0.008882553489754034,1.0
274,3,coat,0.007774517867465609,1.0
275,3,produce,0.00708717753530198,1.0
276,3,substitute,0.006250863834452144,1.0
277,3,wood,0.0057294250721167,1.0
278,3,use,0.0033869815520373905,1.0
279,3,billion,0.002844357728648596,1.0
280,3,stripping,0.0006321789597597317,1.0
281,3,puzzling,-0.00012811614227601611,1.0
282,3,tea,-0.00048264171187174755,1.0
283,3,given,-0.0006041543349107679,1.0
284,3,hots,-0.0018165313268268131,1.0
285,3,employee,-0.0043247485595928805,1.0
286,3,scientist,-0.004667998528082647,1.0
287,3,translation,-0.004993507619126014,1.0
288,3,dumpster,-0.005199487624765466,1.0
289,3,popcorn,-0.005809629892874064,1.0
290,3,sensory,-0.0058820029119267345,1.0
291,3,imperative,-0.006781255129619993,1.0
292,3,fraudulent,-0.007823504188595938,1.0
293,3,say,-0.008224043256544541,1.0
294,3,waft,-0.009476855812727255,1.0
295,3,mop,-0.011349762990040776,1.0
296,3,keen,-0.011860448718840788,1.0
297,3,word,-0.013238588616393295,1.0
298,3,ppm,-0.013371041771327783,1.0
299,3,littered,-0.0179597631177961,1.0
300,3,accept,-0.019614631035171245,1.0
301,3,make,-0.020151104441066374,1.0
302,3,red,-0.022489717070538137,2.0
303,3,tell,-0.023378735057422672,1.0
304,3,sucker,-0.02465781702206542,1.0
305,3,cleanse,-0.025578572496058678,1.0
306,3,strongest,-0.0256895717787335,1.0
307,3,corn,-0.02613478416912524,1.0
308,3,cheapest,-0.0265731882295521,1.0
309,3,theater,-0.03194896603543309,1.0
310,3,favorite,-0.03227230089207461,1.0
311,3,fragrance,-0.035277564991494516,1.0
312,3,company,-0.035601686611158284,1.0
313,3,source,-0.037260767153776644,1.0
314,3,got,-0.03991738300204835,1.0
315,3,smell,-0.04632269907889004,1.0
316,3,error,-0.05835299572277392,1.0
317,3,detect,-0.06632467173112637,2.0
318,3,candy,-0.06704774074183302,1.0
319,3,<BIAS>,-0.07596370884460014,1.0
320,3,immediately,-0.08158523811052705,1.0
321,3,reminiscent,-0.0857330977336863,1.0
322,3,eatin,-0.08826774914371617,3.0
323,3,friend,-0.08845819896594243,1.0
324,3,mistake,-0.10551602268231706,1.0
325,3,garden,-0.13381792099394602,3.0
326,3,natural,-0.20504278482821126,4.0
327,3,floor,-0.27777953818602846,3.0
328,3,extract,-0.29650179114181935,2.0
329,3,chemical,-0.4333866030418134,3.0
330,4,strong,0.1515965083963347,1.0
331,4,substitute,0.13430675296480074,1.0
332,4,floor,0.10845219878538145,3.0
333,4,cheaper,0.10818362110564886,1.0
334,4,lightly,0.10391130044594181,1.0
335,4,pepper,0.10199730590509415,1.0
336,4,scent,0.09386042740417679,1.0
337,4,lot,0.08684335876214826,1.0
338,4,tell,0.08639155962198951,1.0
339,4,criticism,0.08376742185368088,1.0
340,4,use,0.08313298211658966,1.0
341,4,chip,0.07613814108101527,5.0
342,4,le,0.07517364067599716,1.0
343,4,detect,0.0739339587600421,2.0
344,4,coat,0.07153443461431276,1.0
345,4,right,0.05765672869854535,1.0
346,4,make,0.05741927970151863,1.0
347,4,popcorn,0.055476256711742084,1.0
348,4,big,0.049568028950342964,1.0
349,4,contact,0.04899127733053819,1.0
350,4,sucker,0.04526532260043085,1.0
351,4,hint,0.04501899564556776,1.0
352,4,really,0.04483282735793296,1.0
353,4,cleanse,0.04198909915332746,1.0
354,4,favorite,0.04148731638207503,1.0
355,4,lab,0.04074220325484096,1.0
356,4,lemongrass,0.03964034207491335,1.0
357,4,theater,0.0384906061091511,1.0
358,4,like,0.03417697172667742,1.0
359,4,keen,0.031103109182926286,1.0
360,4,user,0.031093092192894144,1.0
361,4,childhood,0.029887559490268594,1.0
362,4,used,0.02932123610306726,1.0
363,4,red,0.029190364181227942,2.0
364,4,candy,0.027182727035351913,1.0
365,4,tostitos,0.025870577614277714,2.0
366,4,say,0.025372938283388075,1.0
367,4,time,0.022849126388198353,1.0
368,4,soda,0.022386121190419994,1.0
369,4,reminiscent,0.02166802824071657,1.0
370,4,tho,0.020507288330900167,1.0
371,4,mop,0.017014355622363603,1.0
372,4,component,0.011307268099053741,1.0
373,4,sensory,0.010062632486705773,1.0
374,4,friend,0.009738081182259788,1.0
375,4,line,0.009492723809526264,1.0
376,4,given,0.008013351915878732,1.0
377,4,hots,0.007985154509110136,1.0
378,4,fraudulent,0.006145571808348924,1.0
379,4,imperative,0.005812816818429281,1.0
380,4,employee,0.004410697672481659,1.0
381,4,strongest,0.004016225046802196,1.0
382,4,waft,0.003382365356743037,1.0
383,4,extract,0.003256249551400113,2.0
384,4,stripping,0.0022066185939905616,1.0
385,4,puzzling,0.0008724384081231429,1.0
386,4,littered,-0.00010754200483334638,1.0
387,4,using,-0.0011177696410452403,1.0
388,4,got,-0.0023782065332493027,1.0
389,4,translation,-0.004011318346360023,1.0
390,4,tea,-0.004428319314837891,1.0
391,4,dumpster,-0.00573501996704254,1.0
392,4,egregious,-0.006122051790817128,1.0
393,4,scientist,-0.006139071569943159,1.0
394,4,billion,-0.006246784163724057,1.0
395,4,eatin,-0.00829783611276305,3.0
396,4,produce,-0.008522660638650054,1.0
397,4,extracted,-0.012235555682546747,1.0
398,4,citrus,-0.012288047976065019,1.0
399,4,palate,-0.013472802413455933,1.0
400,4,advanced,-0.017133023718292856,1.0
401,4,source,-0.018486178856618157,1.0
402,4,ppm,-0.01905346841483148,1.0
403,4,chili,-0.021006430423318147,5.0
404,4,accept,-0.021398140156848593,1.0
405,4,error,-0.021644771487260617,1.0
406,4,different,-0.025829351336373742,1.0
407,4,want,-0.02723731595841843,1.0
408,4,fragrance,-0.030854690505531218,1.0
409,4,combination,-0.032279159617126345,1.0
410,4,example,-0.03343675457988479,1.0
411,4,blue,-0.03486049534290591,1.0
412,4,rotting,-0.03708300555836684,1.0
413,4,colon,-0.041368824674103924,1.0
414,4,mask,-0.04164918087297012,1.0
415,4,corn,-0.047481661962739695,1.0
416,4,lemon,-0.05040337969496726,2.0
417,4,cheapest,-0.05316097472778529,1.0
418,4,unfortunate,-0.05511882795326936,2.0
419,4,herring,-0.05965143491562781,1.0
420,4,mistake,-0.06082591246118066,1.0
421,4,wood,-0.06197754688918595,1.0
422,4,considering,-0.06284284648299501,1.0
423,4,product,-0.06307858674740022,1.0
424,4,going,-0.06371179343192089,1.0
425,4,flavor,-0.06871909735340968,5.0
426,4,word,-0.07537051674711567,1.0
427,4,immediately,-0.07874527282781492,1.0
428,4,smell,-0.08017621434486909,1.0
429,4,garden,-0.08816904102618142,3.0
430,4,detergent,-0.09045296686503691,3.0
431,4,fake,-0.10022966399884495,2.0
432,4,natural,-0.10650316869203166,4.0
433,4,<BIAS>,-0.15391753381277473,1.0
434,4,rate,-0.15419541288902117,1.0
435,4,maybe,-0.17944789894153876,1.0
436,4,company,-0.18052247694447007,1.0
437,4,taste,-0.25207163964037443,3.0
438,4,lime,-0.3100301320046548,6.0
439,4,chemical,-0.540014247060091,3.0
440,5,favorite,0.5074731334226701,1.0
441,5,natural,0.334268862977113,4.0
442,5,right,0.23871795712711363,1.0
443,5,friend,0.233426236876217,1.0
444,5,chip,0.1988878235976596,5.0
445,5,coat,0.19094959539780196,1.0
446,5,chili,0.1608047037454251,5.0
447,5,use,0.13909832563501615,1.0
448,5,garden,0.1368825376566722,3.0
449,5,theater,0.09266182440209178,1.0
450,5,candy,0.08902724381326804,1.0
451,5,using,0.08568191873926134,1.0
452,5,extract,0.078241624764659,2.0
453,5,combination,0.07615591703171669,1.0
454,5,make,0.07334939822819408,1.0
455,5,cheapest,0.06680730500671121,1.0
456,5,soda,0.06614419289277698,1.0
457,5,detergent,0.06485633936536889,3.0
458,5,popcorn,0.04553777857726961,1.0
459,5,source,0.04418602063657772,1.0
460,5,scientist,0.04380835290902443,1.0
461,5,lot,0.04361785692431222,1.0
462,5,citrus,0.04357975309261106,1.0
463,5,blue,0.04274573432179401,1.0
464,5,hint,0.03871576473846421,1.0
465,5,tell,0.03856268066954626,1.0
466,5,lightly,0.038543930059528234,1.0
467,5,tea,0.033519499193746985,1.0
468,5,word,0.03022809912354268,1.0
469,5,time,0.028241362305574013,1.0
470,5,pepper,0.027382326861023185,1.0
471,5,childhood,0.026417979630252945,1.0
472,5,substitute,0.024874006200114852,1.0
473,5,<BIAS>,0.023607328854626054,1.0
474,5,strongest,0.021854532113479423,1.0
475,5,employee,0.01942410674372879,1.0
476,5,cleanse,0.019381140157889106,1.0
477,5,le,0.018305379698374417,1.0
478,5,big,0.0180293639883396,1.0
479,5,really,0.017723409363926367,1.0
480,5,tostitos,0.017389686419745583,2.0
481,5,used,0.015742618695046947,1.0
482,5,palate,0.012396233743611273,1.0
483,5,mask,0.009728898553980047,1.0
484,5,keen,0.00815627913400973,1.0
485,5,fragrance,0.007275832883568975,1.0
486,5,waft,0.004591253154651678,1.0
487,5,billion,0.004142387546865839,1.0
488,5,dumpster,0.003804195372840479,1.0
489,5,sensory,0.003568641684554341,1.0
490,5,lab,0.003151339442608322,1.0
491,5,translation,0.002150741817544467,1.0
492,5,imperative,0.0019426341483706159,1.0
493,5,colon,0.0019030777659081177,1.0
494,5,fraudulent,0.0008069886841498734,1.0
495,5,stripping,-0.00011052978923840359,1.0
496,5,mop,-0.0003500694880546223,1.0
497,5,puzzling,-0.000641699579374794,1.0
498,5,accept,-0.0011776426846540461,1.0
499,5,lemongrass,-0.0017998626075550863,1.0
500,5,unfortunate,-0.0018123248611827164,2.0
501,5,advanced,-0.00205445807521942,1.0
502,5,hots,-0.0020559865288619396,1.0
503,5,littered,-0.0031104883989311032,1.0
504,5,immediately,-0.0035038218293809067,1.0
505,5,egregious,-0.004382440593780231,1.0
506,5,herring,-0.004684281928739732,1.0
507,5,ppm,-0.006062476753027385,1.0
508,5,extracted,-0.006761638545105431,1.0
509,5,sucker,-0.007266611152787856,1.0
510,5,reminiscent,-0.007722620490747649,1.0
511,5,say,-0.010244419730186187,1.0
512,5,component,-0.01248014782921336,1.0
513,5,wood,-0.012729503595782548,1.0
514,5,produce,-0.013772497759222124,1.0
515,5,rotting,-0.015447577685324334,1.0
516,5,cheaper,-0.016682830643226208,1.0
517,5,error,-0.01724681642501473,1.0
518,5,example,-0.025138288347603545,1.0
519,5,lime,-0.030134024756969233,6.0
520,5,user,-0.032128280665331264,1.0
521,5,different,-0.04023405611484676,1.0
522,5,criticism,-0.040411741009474485,1.0
523,5,eatin,-0.04186042884404375,3.0
524,5,strong,-0.04982963382913993,1.0
525,5,detect,-0.05250435957618996,2.0
526,5,lemon,-0.05536146861768113,2.0
527,5,like,-0.056075811798933596,1.0
528,5,tho,-0.056776721661842895,1.0
529,5,corn,-0.05691367877156202,1.0
530,5,red,-0.05893091796999826,2.0
531,5,considering,-0.060672672921651224,1.0
532,5,contact,-0.06211507903245984,1.0
533,5,scent,-0.06586393968144781,1.0
534,5,want,-0.06730409424036572,1.0
535,5,given,-0.07611332523030694,1.0
536,5,rate,-0.07740354081836237,1.0
537,5,chemical,-0.08658900068944106,3.0
538,5,company,-0.09691135133082124,1.0
539,5,product,-0.11178028664569457,1.0
540,5,line,-0.11877128712491544,1.0
541,5,mistake,-0.12294785781573907,1.0
542,5,got,-0.12343046464107527,1.0
543,5,smell,-0.14022806185489517,1.0
544,5,going,-0.14414678161436204,1.0
545,5,fake,-0.20004971868762092,2.0
546,5,floor,-0.205348673925627,3.0
547,5,flavor,-0.3488779518632629,5.0
548,5,maybe,-0.43509798318586007,1.0
549,5,taste,-0.5708961006341752,3.0
