,target,feature,weight,value
0,atis_abbreviation,<BIAS>,10.517422251495088,1.0
1,atis_abbreviation,afternoon,-0.02232272784639613,0.45804477035699276
2,atis_abbreviation,wednesday,-0.07888735915302923,0.4248697021033642
3,atis_abbreviation,thursday,-0.08904684946946186,0.4945665279303746
4,atis_abbreviation,atlanta,-0.09134927524594358,0.31290231313715416
5,atis_abbreviation,morning,-0.09152942672766717,0.41263204000977666
6,atis_abbreviation,boston,-0.18650387245579217,0.2765876473854758
7,atis_abbreviation,flight,-0.20727958842753655,0.14286668379527234
8,atis_aircraft,<BIAS>,0.6384670776061458,1.0
9,atis_aircraft,afternoon,0.05251958068206169,0.45804477035699276
10,atis_aircraft,morning,-0.0022721363750762887,0.41263204000977666
11,atis_aircraft,thursday,-0.003976620990320524,0.4945665279303746
12,atis_aircraft,atlanta,-0.013383190299575158,0.31290231313715416
13,atis_aircraft,wednesday,-0.08096820332903387,0.4248697021033642
14,atis_aircraft,flight,-0.08539876795097268,0.14286668379527234
15,atis_aircraft,boston,-0.16190329237970283,0.2765876473854758
16,atis_airfare,<BIAS>,5.3130812022209,1.0
17,atis_airfare,morning,0.1716407630457624,0.41263204000977666
18,atis_airfare,boston,0.04479154017261517,0.2765876473854758
19,atis_airfare,wednesday,-0.059259250222648475,0.4248697021033642
20,atis_airfare,afternoon,-0.07154550833767861,0.45804477035699276
21,atis_airfare,atlanta,-0.07895053745663529,0.31290231313715416
22,atis_airfare,thursday,-0.08926479565366272,0.4945665279303746
23,atis_airfare,flight,-0.1520475876610957,0.14286668379527234
24,atis_airline,<BIAS>,3.9852655507789416,1.0
25,atis_airline,boston,0.27699055807262435,0.2765876473854758
26,atis_airline,afternoon,0.16855127429113018,0.45804477035699276
27,atis_airline,morning,-0.02692652092657664,0.41263204000977666
28,atis_airline,wednesday,-0.045544529736884234,0.4248697021033642
29,atis_airline,atlanta,-0.08593001463532769,0.31290231313715416
30,atis_airline,flight,-0.17641053063926226,0.14286668379527234
31,atis_airline,thursday,-0.18846335906144054,0.4945665279303746
32,atis_airport,<BIAS>,0.20328082358523084,1.0
33,atis_airport,boston,0.06840344147429599,0.2765876473854758
34,atis_airport,afternoon,-0.00029880240460727355,0.45804477035699276
35,atis_airport,wednesday,-0.0018799846802030412,0.4248697021033642
36,atis_airport,flight,-0.03464826619709284,0.14286668379527234
37,atis_airport,thursday,-0.04544636563030204,0.4945665279303746
38,atis_airport,morning,-0.08956671402961318,0.41263204000977666
39,atis_airport,atlanta,-0.26950567897913796,0.31290231313715416
40,atis_capacity,thursday,-0.0001367657736292687,0.4945665279303746
41,atis_capacity,afternoon,-0.00040016599929753514,0.45804477035699276
42,atis_capacity,morning,-0.0005742928264481025,0.41263204000977666
43,atis_capacity,atlanta,-0.0010446211201957094,0.31290231313715416
44,atis_capacity,flight,-0.003889552301449364,0.14286668379527234
45,atis_capacity,wednesday,-0.008773589354760778,0.4248697021033642
46,atis_capacity,boston,-0.01777661321455771,0.2765876473854758
47,atis_capacity,<BIAS>,-1.0268706185702987,1.0
48,atis_city,morning,0.004550082228666896,0.41263204000977666
49,atis_city,thursday,-6.313195659225916e-05,0.4945665279303746
50,atis_city,afternoon,-0.007921414546121356,0.45804477035699276
51,atis_city,wednesday,-0.01578509676603232,0.4248697021033642
52,atis_city,boston,-0.2112009446883754,0.2765876473854758
53,atis_city,atlanta,-0.2298271200318578,0.31290231313715416
54,atis_city,flight,-0.27402780397855203,0.14286668379527234
55,atis_city,<BIAS>,-3.167500101615553,1.0
56,atis_distance,<BIAS>,0.7823308280931351,1.0
57,atis_distance,atlanta,0.05225518796599974,0.31290231313715416
58,atis_distance,afternoon,-0.0004281064037658794,0.45804477035699276
59,atis_distance,thursday,-0.0005772292874985023,0.4945665279303746
60,atis_distance,wednesday,-0.0017490324478776887,0.4248697021033642
61,atis_distance,morning,-0.002333059258866019,0.41263204000977666
62,atis_distance,flight,-0.004536132466987912,0.14286668379527234
63,atis_distance,boston,-0.009579455119681496,0.2765876473854758
64,atis_flight,<BIAS>,5.621774550734765,1.0
65,atis_flight,atlanta,0.3602945299469379,0.31290231313715416
66,atis_flight,flight,0.27792131876808746,0.14286668379527234
67,atis_flight,wednesday,0.21873345340454226,0.4248697021033642
68,atis_flight,afternoon,0.19793174176196382,0.45804477035699276
69,atis_flight,morning,0.1311684721579699,0.41263204000977666
70,atis_flight,thursday,0.12588303882293186,0.4945665279303746
71,atis_flight,boston,-0.1470394521708593,0.2765876473854758
72,atis_flight#atis_airfare,boston,0.6214200475380324,0.2765876473854758
73,atis_flight#atis_airfare,thursday,0.6026583228517314,0.4945665279303746
74,atis_flight#atis_airfare,flight,0.324800269192535,0.14286668379527234
75,atis_flight#atis_airfare,wednesday,-0.0019647518055284567,0.4248697021033642
76,atis_flight#atis_airfare,afternoon,-0.0032428118625024913,0.45804477035699276
77,atis_flight#atis_airfare,atlanta,-0.15743943350096493,0.31290231313715416
78,atis_flight#atis_airfare,morning,-0.22506663260194917,0.41263204000977666
79,atis_flight#atis_airfare,<BIAS>,-15.786604542265605,1.0
80,atis_flight_no,flight,0.019423801429152343,0.14286668379527234
81,atis_flight_no,boston,0.0027270055143072923,0.2765876473854758
82,atis_flight_no,atlanta,-0.0013409045671340446,0.31290231313715416
83,atis_flight_no,afternoon,-0.0031984525838839374,0.45804477035699276
84,atis_flight_no,morning,-0.0036527289729054186,0.41263204000977666
85,atis_flight_no,wednesday,-0.0061668128058973756,0.4248697021033642
86,atis_flight_no,thursday,-0.23042054027665626,0.4945665279303746
87,atis_flight_no,<BIAS>,-0.39967668139471557,1.0
88,atis_flight_time,atlanta,0.191550383335852,0.31290231313715416
89,atis_flight_time,flight,0.10743693192207589,0.14286668379527234
90,atis_flight_time,morning,0.08464729193300831,0.41263204000977666
91,atis_flight_time,wednesday,0.06300180009602462,0.4248697021033642
92,atis_flight_time,boston,0.03275882221825546,0.2765876473854758
93,atis_flight_time,thursday,-0.0007597134245983679,0.4945665279303746
94,atis_flight_time,afternoon,-0.08218203972148438,0.45804477035699276
95,atis_flight_time,<BIAS>,-3.144814665320342,1.0
96,atis_ground_fare,atlanta,0.17589323076668212,0.31290231313715416
97,atis_ground_fare,afternoon,-7.670689167994708e-05,0.45804477035699276
98,atis_ground_fare,thursday,-0.00014174980036542784,0.4945665279303746
99,atis_ground_fare,wednesday,-0.0012223630553787413,0.4248697021033642
100,atis_ground_fare,morning,-0.0038479900369519037,0.41263204000977666
101,atis_ground_fare,flight,-0.005314337539213001,0.14286668379527234
102,atis_ground_fare,boston,-0.09791356731400845,0.2765876473854758
103,atis_ground_fare,<BIAS>,-2.046680905656237,1.0
104,atis_ground_service,<BIAS>,1.6272978394821676,1.0
105,atis_ground_service,wednesday,0.11594985089560073,0.4248697021033642
106,atis_ground_service,morning,0.10449167683298202,0.41263204000977666
107,atis_ground_service,boston,0.036963421974847,0.2765876473854758
108,atis_ground_service,thursday,-0.0038504363140686895,0.4945665279303746
109,atis_ground_service,afternoon,-0.010266826331111076,0.45804477035699276
110,atis_ground_service,flight,-0.11747570517908709,0.14286668379527234
111,atis_ground_service,atlanta,-0.19515903182114666,0.31290231313715416
112,atis_quantity,atlanta,0.34393647564240826,0.31290231313715416
113,atis_quantity,flight,0.33144595102949725,0.14286668379527234
114,atis_quantity,morning,-0.05072878444233652,0.41263204000977666
115,atis_quantity,thursday,-0.07639380403617203,0.4945665279303746
116,atis_quantity,wednesday,-0.09548413103894293,0.4248697021033642
117,atis_quantity,afternoon,-0.2171190338066698,0.45804477035699276
118,atis_quantity,boston,-0.2521376396220827,0.2765876473854758
119,atis_quantity,<BIAS>,-3.116772609161716,1.0
