,target,feature,weight,value
0,positive,<BIAS>,0.06316543558214203,1.0
1,positive,story,0.027723412795473665,0.3009323356294057
2,positive,series,0.025001455980702345,0.249672183011074
3,positive,saw,0.02109405390350975,0.3353577954239052
4,positive,good,0.018164666172843805,0.13706454980313246
5,positive,lot,0.006582947053246897,0.09978111579448035
6,positive,seen,0.005168962152979918,0.08862979988390411
7,positive,time,0.0031322683649493404,0.06641448035524603
8,positive,end,-0.00031723609481781905,0.1815695663759959
9,positive,long,-0.0005240537496151731,0.10986424716418915
10,positive,make,-0.0031698210798208437,0.07274096957814259
11,positive,going,-0.007712050207385145,0.20890644333929612
12,positive,thing,-0.007906095338229443,0.08433332032448908
13,positive,fact,-0.008277872179414654,0.21587197728907248
14,positive,actually,-0.008422877057445126,0.1041063886922835
15,positive,point,-0.010826346030034713,0.10781331682546344
16,positive,original,-0.011475722078604979,0.11922798828374812
17,positive,like,-0.016054930111525496,0.18304778790877196
18,positive,idea,-0.01667504824332265,0.11995966207567578
19,positive,look,-0.017565900739909296,0.18481472493477227
20,positive,book,-0.032510699061924025,0.6536172443448162
