,target,feature,weight,value
0,blocker,sql,0.044725865843527966,0.39549593985351444
1,blocker,inefficient,-0.0008932853330281301,0.5913149997031426
2,blocker,selects,-0.0009422423898485898,0.5699688802646107
3,blocker,milestone,-0.018868627158546116,0.41117515515332825
4,blocker,<BIAS>,-2.1448073384652573,1.0
5,critical,<BIAS>,0.7289927440896139,1.0
6,critical,inefficient,-0.0014276185414310923,0.5913149997031426
7,critical,selects,-0.004781428915307521,0.5699688802646107
8,critical,milestone,-0.02503572917286435,0.41117515515332825
9,critical,sql,-0.04610889166705093,0.39549593985351444
10,major,sql,0.004841934615420063,0.39549593985351444
11,major,selects,-0.0014862859327732939,0.5699688802646107
12,major,milestone,-0.0031801664066139733,0.41117515515332825
13,major,inefficient,-0.016630807291916287,0.5913149997031426
14,major,<BIAS>,-0.946675846301063,1.0
15,minor,inefficient,0.04629361708546576,0.5913149997031426
16,minor,milestone,0.020347253886795813,0.41117515515332825
17,minor,sql,0.007768069643963443,0.39549593985351444
18,minor,selects,-0.03342583115726641,0.5699688802646107
19,minor,<BIAS>,-0.05861225803419811,1.0
20,normal,<BIAS>,1.9020706188113559,1.0
21,normal,selects,0.0441498906656966,0.5699688802646107
22,normal,sql,0.02879292662368835,0.39549593985351444
23,normal,milestone,0.013357682459797163,0.41117515515332825
24,normal,inefficient,-0.0054111333224113834,0.5913149997031426
25,trivial,<BIAS>,0.5190320798995832,1.0
26,trivial,milestone,0.013379586391431449,0.41117515515332825
27,trivial,selects,-0.003514102270500946,0.5699688802646107
28,trivial,inefficient,-0.021930772596678985,0.5913149997031426
29,trivial,sql,-0.04001990505954863,0.39549593985351444
