,target,feature,weight,value
0,blocker,core,0.15178418668939053,0.21530341641384487
1,blocker,file,0.006877177819554752,0.1641011164860719
2,blocker,difference,-2.464383035920623e-06,0.32591444937978453
3,blocker,seen,-2.4827873820946893e-06,0.33781386686598064
4,blocker,deployable,-5.1586450501773334e-05,0.2771616447502537
5,blocker,destination,-5.736976719142864e-05,0.3091431623950059
6,blocker,cdt,-6.123098694784723e-05,0.31668454411036506
7,blocker,archive,-0.0007498111513152996,0.2880138396393903
8,blocker,directory,-0.0007714627371373644,0.23739471469318005
9,blocker,behavior,-0.001405708974829019,0.32591444937978453
10,blocker,exporting,-0.01262147290559021,0.23279407949869568
11,blocker,org,-0.01757705189648272,0.1809759406542205
12,blocker,eclipse,-0.021554660000114585,0.15215002743393177
13,blocker,plugin,-0.03999899498157616,0.15454162315282793
14,blocker,make,-0.058461722728458315,0.23279407949869568
15,blocker,<BIAS>,-3.9220062239402,1.0
16,critical,exporting,0.11528784123464386,0.23279407949869568
17,critical,eclipse,0.08859021581118755,0.15215002743393177
18,critical,plugin,0.048949386325561395,0.15454162315282793
19,critical,file,0.009721544864107373,0.1641011164860719
20,critical,core,0.0008722538748513361,0.21530341641384487
21,critical,seen,-2.1517191618627946e-06,0.33781386686598064
22,critical,difference,-3.009583634081758e-06,0.32591444937978453
23,critical,cdt,-0.0006148746132619947,0.31668454411036506
24,critical,behavior,-0.0013968969758318347,0.32591444937978453
25,critical,archive,-0.004423082808005617,0.2880138396393903
26,critical,destination,-0.009235693612828923,0.3091431623950059
27,critical,org,-0.009957276537107686,0.1809759406542205
28,critical,make,-0.021084142434960484,0.23279407949869568
29,critical,deployable,-0.0232469973886937,0.2771616447502537
30,critical,directory,-0.03587211263743874,0.23739471469318005
31,critical,<BIAS>,-4.175124173554894,1.0
32,major,<BIAS>,4.232044435231896,1.0
33,major,deployable,0.08293491740143911,0.2771616447502537
34,major,make,0.0442094696791768,0.23279407949869568
35,major,eclipse,0.04010834671315342,0.15215002743393177
36,major,archive,0.0289447733452984,0.2880138396393903
37,major,difference,-0.002853054620863777,0.32591444937978453
38,major,file,-0.006896422869019057,0.1641011164860719
39,major,seen,-0.007361215618234292,0.33781386686598064
40,major,exporting,-0.008372039841629306,0.23279407949869568
41,major,org,-0.009948331667103206,0.1809759406542205
42,major,behavior,-0.016378700583132285,0.32591444937978453
43,major,plugin,-0.02327210434331305,0.15454162315282793
44,major,cdt,-0.03185155808567398,0.31668454411036506
45,major,destination,-0.04787974507299053,0.3091431623950059
46,major,directory,-0.08101471637449606,0.23739471469318005
47,major,core,-0.1265318963669635,0.21530341641384487
48,minor,make,0.07694593176236006,0.23279407949869568
49,minor,org,0.06698320357677245,0.1809759406542205
50,minor,file,0.045146775854269613,0.1641011164860719
51,minor,seen,-1.9466896135388832e-05,0.33781386686598064
52,minor,behavior,-2.274927067278017e-05,0.32591444937978453
53,minor,difference,-5.4424224109984544e-05,0.32591444937978453
54,minor,destination,-8.3149626102029e-05,0.3091431623950059
55,minor,cdt,-0.001101883047869945,0.31668454411036506
56,minor,archive,-0.008376601067544422,0.2880138396393903
57,minor,plugin,-0.012472681651878826,0.15454162315282793
58,minor,directory,-0.02293235837903612,0.23739471469318005
59,minor,eclipse,-0.04020288491950912,0.15215002743393177
60,minor,core,-0.042162970354427606,0.21530341641384487
61,minor,exporting,-0.059014279817160786,0.23279407949869568
62,minor,deployable,-0.10194435387395961,0.2771616447502537
63,minor,<BIAS>,-3.2396766541231368,1.0
64,normal,<BIAS>,9.60432205597757,1.0
65,normal,directory,0.1425285234892978,0.23739471469318005
66,normal,destination,0.057269039304256725,0.3091431623950059
67,normal,deployable,0.04238976948388869,0.2771616447502537
68,normal,cdt,0.03683913504668915,0.31668454411036506
69,normal,behavior,0.021457804506640376,0.32591444937978453
70,normal,file,0.008234485104584601,0.1641011164860719
71,normal,seen,0.0074705219204539855,0.33781386686598064
72,normal,plugin,0.004790408316105273,0.15454162315282793
73,normal,difference,0.0029320107843539803,0.32591444937978453
74,normal,archive,-0.011023958153166789,0.2880138396393903
75,normal,org,-0.0183404413767078,0.1809759406542205
76,normal,core,-0.018695871600263793,0.21530341641384487
77,normal,exporting,-0.024814153736320354,0.23279407949869568
78,normal,make,-0.02605857988111464,0.23279407949869568
79,normal,eclipse,-0.039189205251801716,0.15215002743393177
80,trivial,core,0.03473429775740986,0.21530341641384487
81,trivial,plugin,0.022003986335105214,0.15454162315282793
82,trivial,destination,-1.3081225143293319e-05,0.3091431623950059
83,trivial,difference,-1.9057972710963135e-05,0.32591444937978453
84,trivial,deployable,-8.174917217336135e-05,0.2771616447502537
85,trivial,seen,-8.520489953881444e-05,0.33781386686598064
86,trivial,directory,-0.0019378733611918632,0.23739471469318005
87,trivial,behavior,-0.002253748702174294,0.32591444937978453
88,trivial,cdt,-0.0032095883129342187,0.31668454411036506
89,trivial,archive,-0.004371320165263956,0.2880138396393903
90,trivial,exporting,-0.010465894933938782,0.23279407949869568
91,trivial,org,-0.011160102099375598,0.1809759406542205
92,trivial,make,-0.01555095639699919,0.23279407949869568
93,trivial,eclipse,-0.027751812352896574,0.15215002743393177
94,trivial,file,-0.06308356077350102,0.1641011164860719
95,trivial,<BIAS>,-2.499559439590924,1.0
