,target,feature,weight,value
0,positive,year,0.06885182183026564,0.5883757680918258
1,positive,<BIAS>,0.06316543558214203,1.0
2,positive,saw,0.030289354525723115,0.48154665788871814
3,positive,series,0.026925050798299377,0.2688817889519816
4,positive,watch,0.0032686767510539646,0.18846821031862945
5,positive,sure,-0.0030794660812918893,0.2530475709937917
6,positive,make,-0.006827409864575319,0.15667521943688167
7,positive,kid,-0.009407778583183089,0.26657191424580534
8,positive,old,-0.014370707689066101,0.22470850099091996
9,positive,movie,-0.030985149916644125,0.3224506095731906
