,target,feature,weight,value
0,1,money,0.6173374235927116,1.0
1,1,product,0.4314749839329824,4.0
2,1,consumer,0.2856595814752716,1.0
3,1,item,0.25558870555181845,1.0
4,1,<BIAS>,0.22487133150248942,1.0
5,1,corn,0.21692316568232853,2.0
6,1,new,0.20822246072921133,1.0
7,1,spent,0.1829115006959443,1.0
8,1,artificial,0.17622829245850521,1.0
9,1,listed,0.12919277137751112,1.0
10,1,pack,0.10461541326604745,1.0
11,1,ingredient,0.10378132182303988,1.0
12,1,aware,0.10098661963454095,1.0
13,1,flavored,0.09295139409345436,2.0
14,1,line,0.09229696907297076,1.0
15,1,obviously,0.08183510135921397,1.0
16,1,offer,0.07829089053491528,1.0
17,1,texture,0.07229295519523725,1.0
18,1,tasting,0.06293031893302913,1.0
19,1,meant,0.06130812922457872,1.0
20,1,rise,0.05578697959328878,1.0
21,1,syrup,0.04435582798317458,1.0
22,1,red,0.04216693151339945,1.0
23,1,chemically,0.03270250700084076,1.0
24,1,aside,0.03192523689240985,1.0
25,1,type,0.02677873040819026,1.0
26,1,firm,0.0247316727086459,1.0
27,1,sugar,0.01877836977151395,2.0
28,1,non,0.017483149036727978,2.0
29,1,perspective,0.015420611019790836,1.0
30,1,specified,0.010411937098274766,1.0
31,1,induced,0.00995381705660757,1.0
32,1,basically,0.0016790578816730925,1.0
33,1,lame,0.0014152419204071013,1.0
34,1,newman,0.00022715504923065492,1.0
35,1,tang,0.00017921907504068725,1.0
36,1,strictly,-0.00019572747629304388,1.0
37,1,moreso,-0.0014029775840882436,1.0
38,1,earns,-0.0014231772084956657,1.0
39,1,offering,-0.0024909323335036526,1.0
40,1,criterion,-0.0025063406926361218,1.0
41,1,consideration,-0.004821244465949986,1.0
42,1,candy,-0.005424437291987586,2.0
43,1,organic,-0.007038273694084467,2.0
44,1,distinction,-0.00782209437362122,1.0
45,1,painfully,-0.008156768376156037,1.0
46,1,expected,-0.01457118772366107,1.0
47,1,sampling,-0.019681760202659493,1.0
48,1,enjoyment,-0.021913317733093015,1.0
49,1,decide,-0.02773160257336443,1.0
50,1,rope,-0.028395168902769236,1.0
51,1,available,-0.028736963764716197,1.0
52,1,distinct,-0.029940977682967867,1.0
53,1,licorice,-0.036508591713505456,7.0
54,1,appeal,-0.04008039171634965,2.0
55,1,worth,-0.040614194574566366,1.0
56,1,worthwhile,-0.044512106692099686,1.0
57,1,aisle,-0.050425291978102874,1.0
58,1,distinctive,-0.0519863723364139,1.0
59,1,surprisingly,-0.05441030726669641,1.0
60,1,strawberry,-0.05891582611271356,1.0
61,1,similar,-0.05917743693742885,1.0
62,1,sensitive,-0.06096653398804004,1.0
63,1,chewy,-0.06285357670499295,1.0
64,1,usually,-0.06288404709639742,1.0
65,1,sweetness,-0.07127019737165215,1.0
66,1,pomegranate,-0.07633495111977534,1.0
67,1,kid,-0.07690046738428295,1.0
68,1,twist,-0.08269815968814706,2.0
69,1,price,-0.09900931672504001,1.0
70,1,overly,-0.10480402129727846,1.0
71,1,sweet,-0.10602885558804467,1.0
72,1,enjoyable,-0.11224853034728205,1.0
73,1,individual,-0.12119702523506759,1.0
74,1,issue,-0.13949621316096444,2.0
75,1,refreshing,-0.17886606981209832,1.0
76,1,pretty,-0.19547868980193006,1.0
77,1,little,-0.31650705826731695,1.0
78,1,flavor,-0.41845527630949936,4.0
79,2,flavor,0.48813647147908085,4.0
80,2,product,0.2079626099489639,4.0
81,2,texture,0.19881053503508944,1.0
82,2,basically,0.19539354824136065,1.0
83,2,listed,0.19375665890758778,1.0
84,2,money,0.18473979786973446,1.0
85,2,enjoyable,0.11782127475539617,1.0
86,2,expected,0.11503942001468732,1.0
87,2,pomegranate,0.10728359370971985,1.0
88,2,sugar,0.1053527137505703,2.0
89,2,non,0.09772981658121642,2.0
90,2,tang,0.0630025124906223,1.0
91,2,sweetness,0.052818089212222086,1.0
92,2,ingredient,0.0525923464426143,1.0
93,2,twist,0.052522147026677055,2.0
94,2,sampling,0.05068664463044602,1.0
95,2,syrup,0.044243717532749895,1.0
96,2,corn,0.04413708412452586,2.0
97,2,artificial,0.0426407041301073,1.0
98,2,aside,0.03731080170031972,1.0
99,2,rise,0.035587454574857305,1.0
100,2,strictly,0.03557892420948332,1.0
101,2,distinctive,0.029827876655948524,1.0
102,2,decide,0.029824152260254103,1.0
103,2,spent,0.026501845515221407,1.0
104,2,chewy,0.026409901064879938,1.0
105,2,usually,0.023912608874627525,1.0
106,2,strawberry,0.023885583420357175,1.0
107,2,issue,0.022554862446175297,2.0
108,2,item,0.02254954478689651,1.0
109,2,overly,0.020106498428723474,1.0
110,2,offering,0.019771652353219354,1.0
111,2,worth,0.01758850808592419,1.0
112,2,pretty,0.01723867050581138,1.0
113,2,chemically,0.015875498055155576,1.0
114,2,painfully,0.014992528420662126,1.0
115,2,specified,0.014186341549879104,1.0
116,2,sweet,0.013415486235416529,1.0
117,2,rope,0.005121232979216115,1.0
118,2,distinction,-0.002647242340332062,1.0
119,2,perspective,-0.004750250858056222,1.0
120,2,organic,-0.006032514167419817,2.0
121,2,earns,-0.006828257184026829,1.0
122,2,obviously,-0.008050073128276165,1.0
123,2,aware,-0.008395592409769682,1.0
124,2,lame,-0.009606673415721346,1.0
125,2,moreso,-0.011080085729141336,1.0
126,2,distinct,-0.012630529680937487,1.0
127,2,criterion,-0.012685102370608213,1.0
128,2,induced,-0.014989635784539096,1.0
129,2,red,-0.016051796083745302,1.0
130,2,<BIAS>,-0.01859741769963329,1.0
131,2,worthwhile,-0.018880254047043025,1.0
132,2,enjoyment,-0.019475703976768295,1.0
133,2,surprisingly,-0.021132167039107398,1.0
134,2,new,-0.02391007004038181,1.0
135,2,consideration,-0.034083082886912454,1.0
136,2,aisle,-0.035885926345792,1.0
137,2,meant,-0.04455272417310765,1.0
138,2,little,-0.05476524522140701,1.0
139,2,tasting,-0.055691767962440145,1.0
140,2,similar,-0.06695181449579625,1.0
141,2,price,-0.07697609975732465,1.0
142,2,individual,-0.07751370947796994,1.0
143,2,appeal,-0.07752081584646597,2.0
144,2,newman,-0.08943848824650596,1.0
145,2,consumer,-0.09116902132922426,1.0
146,2,candy,-0.09290002292158676,2.0
147,2,line,-0.09839258480260031,1.0
148,2,type,-0.10250166785741514,1.0
149,2,kid,-0.10943276686718893,1.0
150,2,offer,-0.11454853278730118,1.0
151,2,pack,-0.11477231540332737,1.0
152,2,sensitive,-0.11625067129962298,1.0
153,2,firm,-0.15747990685665625,1.0
154,2,available,-0.1584611662236056,1.0
155,2,refreshing,-0.2080969538352694,1.0
156,2,flavored,-0.24524187309233558,2.0
157,2,licorice,-1.2764166762625773,7.0
158,3,licorice,0.4257753625329955,7.0
159,3,flavor,0.2643964442037485,4.0
160,3,issue,0.21244959855317586,2.0
161,3,twist,0.21117753883586687,2.0
162,3,expected,0.20366512310092316,1.0
163,3,appeal,0.16921913951245887,2.0
164,3,similar,0.1583932823953508,1.0
165,3,newman,0.14649621188730255,1.0
166,3,sensitive,0.1339031645991044,1.0
167,3,line,0.1153741790450187,1.0
168,3,individual,0.11497735950600044,1.0
169,3,little,0.11175220897830793,1.0
170,3,flavored,0.10944891917703274,2.0
171,3,strawberry,0.10860732875159279,1.0
172,3,price,0.09610211912074443,1.0
173,3,rope,0.08153185665094646,1.0
174,3,basically,0.07683624198215805,1.0
175,3,chewy,0.07509064693070415,1.0
176,3,pretty,0.07466163320158742,1.0
177,3,aware,0.07219163077350993,1.0
178,3,firm,0.07204615421491112,1.0
179,3,overly,0.06374710685171786,1.0
180,3,enjoyment,0.06368599858424344,1.0
181,3,product,0.05999789969042908,4.0
182,3,tang,0.05223445120796672,1.0
183,3,consideration,0.04954458669715294,1.0
184,3,sweet,0.04511941945597276,1.0
185,3,ingredient,0.037473186845320895,1.0
186,3,worthwhile,0.03514592785826231,1.0
187,3,aside,0.03398754704389488,1.0
188,3,aisle,0.031687491651251315,1.0
189,3,obviously,0.028283000337324584,1.0
190,3,lame,0.02449957289492142,1.0
191,3,kid,0.02306447626143285,1.0
192,3,criterion,0.021868961244539527,1.0
193,3,pack,0.01960760372734329,1.0
194,3,moreso,0.016165099724073435,1.0
195,3,offer,0.012140195885949494,1.0
196,3,rise,0.011267967915924574,1.0
197,3,decide,0.011068823691863018,1.0
198,3,painfully,0.01096895021748751,1.0
199,3,sugar,0.008381751619458196,2.0
200,3,pomegranate,0.005340078737493802,1.0
201,3,sweetness,0.003279520046802707,1.0
202,3,distinction,0.0009640122187995171,1.0
203,3,specified,0.00017347234947131116,1.0
204,3,induced,-0.002790403767859704,1.0
205,3,texture,-0.006077322300530844,1.0
206,3,distinctive,-0.006177262222837663,1.0
207,3,syrup,-0.009076419857281895,1.0
208,3,earns,-0.009807053955965088,1.0
209,3,red,-0.011244858535269069,1.0
210,3,meant,-0.012020422092762334,1.0
211,3,available,-0.013232811217907757,1.0
212,3,artificial,-0.013362866970280949,1.0
213,3,chemically,-0.015339003959497704,1.0
214,3,distinct,-0.021519488788021353,1.0
215,3,consumer,-0.022377455279699837,1.0
216,3,organic,-0.02384591171147268,2.0
217,3,tasting,-0.02616731516815205,1.0
218,3,perspective,-0.027583800135281684,1.0
219,3,type,-0.027787557310774508,1.0
220,3,sampling,-0.030950130906482118,1.0
221,3,spent,-0.03634625343511199,1.0
222,3,strictly,-0.04169413053361459,1.0
223,3,offering,-0.042758836470213786,1.0
224,3,corn,-0.05226956833825048,2.0
225,3,enjoyable,-0.056452819426748804,1.0
226,3,usually,-0.061434011744057236,1.0
227,3,<BIAS>,-0.07596370884460014,1.0
228,3,refreshing,-0.07666781562863634,1.0
229,3,item,-0.08557143852527936,1.0
230,3,surprisingly,-0.09103635312083244,1.0
231,3,worth,-0.09188720410790571,1.0
232,3,listed,-0.09277025159244427,1.0
233,3,candy,-0.13409548148366604,2.0
234,3,money,-0.14050212998906264,1.0
235,3,non,-0.19241104038642434,2.0
236,3,new,-0.23713622787814148,1.0
237,4,licorice,0.6594492954705248,7.0
238,4,pretty,0.28359095652433175,1.0
239,4,little,0.25111263037776194,1.0
240,4,refreshing,0.21635953029159222,1.0
241,4,flavored,0.16932163951101634,2.0
242,4,surprisingly,0.15039412232070629,1.0
243,4,price,0.14027039628677992,1.0
244,4,non,0.11305075872200823,2.0
245,4,kid,0.10510647493154374,1.0
246,4,type,0.08456620835670074,1.0
247,4,available,0.08341464516072664,1.0
248,4,issue,0.07563808757598675,2.0
249,4,individual,0.06572178332532236,1.0
250,4,usually,0.06384658561670782,1.0
251,4,distinct,0.05972660617427266,1.0
252,4,sweet,0.05907862448800573,1.0
253,4,candy,0.054365454070703825,2.0
254,4,appeal,0.05431209453385281,2.0
255,4,aisle,0.05102610919616445,1.0
256,4,offering,0.04598562793795056,1.0
257,4,perspective,0.04395267079392217,1.0
258,4,pack,0.04055638679199613,1.0
259,4,enjoyable,0.03653093848806423,1.0
260,4,decide,0.035989914220100463,1.0
261,4,chewy,0.03593393204733699,1.0
262,4,meant,0.03193997591833459,1.0
263,4,overly,0.03002564927649071,1.0
264,4,distinctive,0.028889619604433328,1.0
265,4,distinction,0.024915639154024383,1.0
266,4,worth,0.024656416347616148,1.0
267,4,similar,0.02296006566964675,1.0
268,4,firm,0.02059059528450129,1.0
269,4,organic,0.01772207535541247,2.0
270,4,consideration,0.015263149980634546,1.0
271,4,strictly,0.014996992597602673,1.0
272,4,rope,0.014977040809799272,1.0
273,4,induced,0.01490103703541367,1.0
274,4,red,0.014595182090613971,1.0
275,4,worthwhile,0.013341435305811663,1.0
276,4,new,0.013219000740181298,1.0
277,4,line,0.009492723809526264,1.0
278,4,aware,0.00856442871982336,1.0
279,4,specified,0.007898268315456687,1.0
280,4,offer,0.005780557268455328,1.0
281,4,earns,0.005203577917481889,1.0
282,4,sensitive,6.090901786181551e-05,1.0
283,4,tasting,-0.0010047067104207658,1.0
284,4,sampling,-0.005690844488213719,1.0
285,4,rise,-0.006470642316830466,1.0
286,4,moreso,-0.00699295439567907,1.0
287,4,painfully,-0.009357633658511971,1.0
288,4,obviously,-0.010741877664109637,1.0
289,4,pomegranate,-0.015950502378344843,1.0
290,4,enjoyment,-0.016306929573873648,1.0
291,4,criterion,-0.016943659014114352,1.0
292,4,chemically,-0.018336232749043616,1.0
293,4,lame,-0.020107154628320734,1.0
294,4,expected,-0.026839310177882426,1.0
295,4,ingredient,-0.030194059988548263,1.0
296,4,listed,-0.036004463663164024,1.0
297,4,sweetness,-0.051958942115941396,1.0
298,4,item,-0.05227795582930092,1.0
299,4,flavor,-0.05497527788272775,4.0
300,4,newman,-0.05506406452061691,1.0
301,4,strawberry,-0.05935183679284296,1.0
302,4,aside,-0.061724021404308355,1.0
303,4,tang,-0.07642510011808999,1.0
304,4,consumer,-0.07753867688276049,1.0
305,4,sugar,-0.08658427063382602,2.0
306,4,twist,-0.09024078492182609,2.0
307,4,syrup,-0.09376845020847163,1.0
308,4,corn,-0.09496332392547939,2.0
309,4,spent,-0.10023984348644116,1.0
310,4,texture,-0.10300039837881897,1.0
311,4,artificial,-0.11402635159042375,1.0
312,4,basically,-0.11774645136627111,1.0
313,4,<BIAS>,-0.15391753381277473,1.0
314,4,product,-0.25231434698960087,4.0
315,4,money,-0.3019208831213873,1.0
316,5,refreshing,0.24727130898441194,1.0
317,5,licorice,0.22770060997256203,7.0
318,5,candy,0.17805448762653608,2.0
319,5,available,0.11701629604550308,1.0
320,5,worth,0.09025647424893156,1.0
321,5,sweetness,0.06713153022856864,1.0
322,5,kid,0.05816228305849541,1.0
323,5,sensitive,0.04325313167069642,1.0
324,5,firm,0.0401114846485979,1.0
325,5,new,0.03960483644913061,1.0
326,5,usually,0.03655886434911904,1.0
327,5,<BIAS>,0.023607328854626054,1.0
328,5,tasting,0.019933470907984037,1.0
329,5,organic,0.019194624217564026,2.0
330,5,type,0.018944286403298396,1.0
331,5,offer,0.01833688909798079,1.0
332,5,individual,0.01801159188171466,1.0
333,5,surprisingly,0.01618470510593006,1.0
334,5,worthwhile,0.014904997575068742,1.0
335,5,enjoyable,0.014349136530570157,1.0
336,5,syrup,0.01424532454982922,1.0
337,5,earns,0.012854910431005702,1.0
338,5,criterion,0.010266140832819189,1.0
339,5,little,0.00840746413265225,1.0
340,5,sampling,0.005636090966909414,1.0
341,5,distinct,0.00436438997765403,1.0
342,5,lame,0.003799013228713555,1.0
343,5,aisle,0.0035976174764791825,1.0
344,5,moreso,0.0033109179848352325,1.0
345,5,distinctive,-0.0005538617011302246,1.0
346,5,newman,-0.0022208141694105587,1.0
347,5,enjoyment,-0.005990047300508341,1.0
348,5,induced,-0.00707481453962241,1.0
349,5,painfully,-0.008447076603481657,1.0
350,5,strictly,-0.008686058797178361,1.0
351,5,overly,-0.009075233259653554,1.0
352,5,sweet,-0.011584674591350262,1.0
353,5,strawberry,-0.014225249266393174,1.0
354,5,chemically,-0.014902768347455088,1.0
355,5,distinction,-0.015410314658870591,1.0
356,5,pomegranate,-0.02033821894909307,1.0
357,5,offering,-0.020507511487452446,1.0
358,5,consideration,-0.02590340932492498,1.0
359,5,perspective,-0.027039230820375192,1.0
360,5,red,-0.02946545898499913,1.0
361,5,specified,-0.03267001931308188,1.0
362,5,non,-0.03585268395352795,2.0
363,5,meant,-0.036674958877043314,1.0
364,5,tang,-0.038991082655539466,1.0
365,5,aside,-0.04149956423231622,1.0
366,5,sugar,-0.04592856450771564,2.0
367,5,decide,-0.049151287598853045,1.0
368,5,pack,-0.05000708838205931,1.0
369,5,similar,-0.05522409663177221,1.0
370,5,price,-0.06038709892515999,1.0
371,5,spent,-0.07282724928961247,1.0
372,5,rope,-0.07323496153719257,1.0
373,5,chewy,-0.07458090333792788,1.0
374,5,twist,-0.09076074125257087,2.0
375,5,obviously,-0.09132615090415282,1.0
376,5,artificial,-0.09147977802790734,1.0
377,5,consumer,-0.09457442798358695,1.0
378,5,rise,-0.09617175976724024,1.0
379,5,appeal,-0.10593002648349611,2.0
380,5,corn,-0.11382735754312404,2.0
381,5,line,-0.11877128712491544,1.0
382,5,flavored,-0.12648007968916777,2.0
383,5,item,-0.1402888559841346,1.0
384,5,basically,-0.15616239673892016,1.0
385,5,texture,-0.16202576955097675,1.0
386,5,ingredient,-0.16365279512242717,1.0
387,5,issue,-0.17114633541437274,2.0
388,5,aware,-0.17334708671810461,1.0
389,5,pretty,-0.18001257042980068,1.0
390,5,listed,-0.19417471502949088,1.0
391,5,expected,-0.2772940452140668,1.0
392,5,flavor,-0.27910236149061035,4.0
393,5,money,-0.3596542083519968,1.0
394,5,product,-0.4471211465827783,4.0
