,target,feature,weight,value
0,blocker,mark,0.03008901677882326,0.4943536139233307
1,blocker,product,0.004778155920154205,0.3114738029339363
2,blocker,updated,-0.007317827480015563,0.47502811557160685
3,blocker,admin,-0.01152317089744432,0.40287735018127807
4,blocker,strange,-0.019246690306988862,0.5202275508027364
5,blocker,<BIAS>,-2.1448073384652573,1.0
6,critical,<BIAS>,0.7289927440896139,1.0
7,critical,updated,-0.003988135727272848,0.47502811557160685
8,critical,strange,-0.006313551002322218,0.5202275508027364
9,critical,mark,-0.020598838249271334,0.4943536139233307
10,critical,product,-0.0355324287210439,0.3114738029339363
11,critical,admin,-0.04591383735873745,0.40287735018127807
12,major,product,0.0663810922887893,0.3114738029339363
13,major,strange,-0.01164158160522141,0.5202275508027364
14,major,admin,-0.02041361460572895,0.40287735018127807
15,major,updated,-0.027949989109081294,0.47502811557160685
16,major,mark,-0.03907158661825925,0.4943536139233307
17,major,<BIAS>,-0.946675846301063,1.0
18,minor,strange,0.09389096918675714,0.5202275508027364
19,minor,mark,0.04565565550660598,0.4943536139233307
20,minor,updated,-0.0078093514114825294,0.47502811557160685
21,minor,admin,-0.05838133632794243,0.40287735018127807
22,minor,<BIAS>,-0.05861225803419811,1.0
23,minor,product,-0.06529155901621528,0.3114738029339363
24,normal,<BIAS>,1.9020706188113559,1.0
25,normal,mark,0.05297101083618536,0.4943536139233307
26,normal,product,0.025792414800674714,0.3114738029339363
27,normal,updated,0.007716317531282719,0.47502811557160685
28,normal,admin,0.005258427711483776,0.40287735018127807
29,normal,strange,-0.06439229360213028,0.5202275508027364
30,trivial,<BIAS>,0.5190320798995832,1.0
31,trivial,admin,0.1309735314783695,0.40287735018127807
32,trivial,updated,0.03934898619656953,0.47502811557160685
33,trivial,strange,0.007703147329905689,0.5202275508027364
34,trivial,product,0.0038723247276411937,0.3114738029339363
35,trivial,mark,-0.0690452582540842,0.4943536139233307
