,target,feature,weight,value
0,1,company,0.2954051692408974,1.0
1,1,<BIAS>,0.22487133150248942,1.0
2,1,buy,0.1940964655818419,1.0
3,1,active,0.03020231707386583,1.0
4,1,extract,0.02578915556178662,2.0
5,1,ali,-0.0019103064544425095,1.0
6,1,specializes,-0.015919399911868443,1.0
7,1,coffee,-0.01872458054820371,1.0
8,1,doubtful,-0.024036035741416436,1.0
9,1,stomach,-0.07289293348091642,1.0
10,1,substitute,-0.08821401679292881,1.0
11,1,flavor,-0.10461381907737484,1.0
12,1,need,-0.15029613280621132,1.0
13,1,smooth,-0.2517732920727163,1.0
14,1,good,-0.3622506558145149,1.0
15,1,easy,-0.3940971499520597,1.0
16,1,nice,-0.47233497790715945,1.0
17,2,extract,0.18921476126397394,2.0
18,2,flavor,0.12203411786977021,1.0
19,2,buy,0.07925251474454821,1.0
20,2,doubtful,0.03405761807938214,1.0
21,2,coffee,0.022297413015177393,1.0
22,2,stomach,0.017762546679435113,1.0
23,2,company,0.01763034564555279,1.0
24,2,specializes,-0.0038900454189087132,1.0
25,2,ali,-0.011853471709004025,1.0
26,2,active,-0.016170044749567597,1.0
27,2,<BIAS>,-0.01859741769963329,1.0
28,2,need,-0.03756658099992933,1.0
29,2,substitute,-0.0772176062064391,1.0
30,2,easy,-0.11925901729128409,1.0
31,2,good,-0.13519026085246652,1.0
32,2,nice,-0.23621662268078286,1.0
33,2,smooth,-0.31852450208931354,1.0
34,3,nice,0.1411119863427809,1.0
35,3,good,0.07946124783529653,1.0
36,3,flavor,0.06609911105093713,1.0
37,3,ali,0.031226639510451147,1.0
38,3,need,0.021128061039627548,1.0
39,3,specializes,0.014979528851133676,1.0
40,3,substitute,0.006250863834452144,1.0
41,3,doubtful,0.0055307312017695495,1.0
42,3,buy,0.0008115226834403601,1.0
43,3,coffee,-0.004565175617185527,1.0
44,3,easy,-0.017702360574172498,1.0
45,3,stomach,-0.01951393576829359,1.0
46,3,company,-0.035601686611158284,1.0
47,3,smooth,-0.06709566944474703,1.0
48,3,active,-0.07269757683826877,1.0
49,3,<BIAS>,-0.07596370884460014,1.0
50,3,extract,-0.29650179114181935,2.0
51,4,nice,0.397108489051341,1.0
52,4,good,0.33288314381165085,1.0
53,4,smooth,0.27478264784978496,1.0
54,4,easy,0.22245283655331474,1.0
55,4,need,0.15296678174655914,1.0
56,4,substitute,0.13430675296480074,1.0
57,4,active,0.037279062625348296,1.0
58,4,coffee,0.013698784405126061,1.0
59,4,extract,0.003256249551400113,2.0
60,4,specializes,-0.0036297059547727266,1.0
61,4,doubtful,-0.007901342584306385,1.0
62,4,stomach,-0.01047511381906375,1.0
63,4,flavor,-0.013743819470681937,1.0
64,4,ali,-0.030994753616215797,1.0
65,4,<BIAS>,-0.15391753381277473,1.0
66,4,buy,-0.15458011457347107,1.0
67,4,company,-0.18052247694447007,1.0
68,5,smooth,0.36261081575699206,1.0
69,5,easy,0.30860569126420184,1.0
70,5,nice,0.170331125193821,1.0
71,5,stomach,0.08511943638883832,1.0
72,5,good,0.08509652502003252,1.0
73,5,extract,0.078241624764659,2.0
74,5,substitute,0.024874006200114852,1.0
75,5,<BIAS>,0.023607328854626054,1.0
76,5,active,0.021386241888622246,1.0
77,5,need,0.013767871019953951,1.0
78,5,ali,0.013531892269211173,1.0
79,5,specializes,0.008459622434416126,1.0
80,5,doubtful,-0.0076509709554289495,1.0
81,5,coffee,-0.012706441254915522,1.0
82,5,flavor,-0.06977559037265259,1.0
83,5,company,-0.09691135133082124,1.0
84,5,buy,-0.11958038843635978,1.0
