,target,feature,weight,value
0,atis_abbreviation,<BIAS>,10.517422251495088,1.0
1,atis_abbreviation,nineteenth,-0.01199399619044315,0.7284238543344167
2,atis_abbreviation,baltimore,-0.05874000604062229,0.32048067958023013
3,atis_abbreviation,dallas,-0.062070142772171606,0.30667496513065673
4,atis_abbreviation,july,-0.10954863498062666,0.5040161988348846
5,atis_abbreviation,flight,-0.19791860409620035,0.1364146602331692
6,atis_aircraft,<BIAS>,0.6384670776061458,1.0
7,atis_aircraft,july,0.018409475324019826,0.5040161988348846
8,atis_aircraft,nineteenth,-0.00835397735885655,0.7284238543344167
9,atis_aircraft,dallas,-0.02587232732020211,0.30667496513065673
10,atis_aircraft,baltimore,-0.034095704039970434,0.32048067958023013
11,atis_aircraft,flight,-0.08154206148619725,0.1364146602331692
12,atis_airfare,<BIAS>,5.3130812022209,1.0
13,atis_airfare,dallas,0.2985470587802895,0.30667496513065673
14,atis_airfare,nineteenth,-0.008630373199968212,0.7284238543344167
15,atis_airfare,july,-0.09557136394464574,0.5040161988348846
16,atis_airfare,flight,-0.1451809439336041,0.1364146602331692
17,atis_airfare,baltimore,-0.15839377059322995,0.32048067958023013
18,atis_airline,<BIAS>,3.9852655507789416,1.0
19,atis_airline,baltimore,0.12551928311815683,0.32048067958023013
20,atis_airline,nineteenth,-0.03909854845738257,0.7284238543344167
21,atis_airline,dallas,-0.05503912155903191,0.30667496513065673
22,atis_airline,flight,-0.16844362841929694,0.1364146602331692
23,atis_airline,july,-0.18484621441452045,0.5040161988348846
24,atis_airport,baltimore,0.2596942454858404,0.32048067958023013
25,atis_airport,<BIAS>,0.20328082358523084,1.0
26,atis_airport,nineteenth,-0.004390109769663739,0.7284238543344167
27,atis_airport,july,-0.0144635330210214,0.5040161988348846
28,atis_airport,flight,-0.03308351069251338,0.1364146602331692
29,atis_airport,dallas,-0.14084828505720715,0.30667496513065673
30,atis_capacity,baltimore,0.03166916646369801,0.32048067958023013
31,atis_capacity,dallas,-0.0008658384109845456,0.30667496513065673
32,atis_capacity,flight,-0.0037138956512890956,0.1364146602331692
33,atis_capacity,july,-0.021392086332280017,0.5040161988348846
34,atis_capacity,nineteenth,-0.10605053616256548,0.7284238543344167
35,atis_capacity,<BIAS>,-1.0268706185702987,1.0
36,atis_city,nineteenth,-8.07381040025864e-06,0.7284238543344167
37,atis_city,july,-0.03935858379004713,0.5040161988348846
38,atis_city,dallas,-0.06366061503954352,0.30667496513065673
39,atis_city,baltimore,-0.20338639140491022,0.32048067958023013
40,atis_city,flight,-0.2616523935541414,0.1364146602331692
41,atis_city,<BIAS>,-3.167500101615553,1.0
42,atis_distance,<BIAS>,0.7823308280931351,1.0
43,atis_distance,nineteenth,-0.0019095715550841996,0.7284238543344167
44,atis_distance,baltimore,-0.00248310402997527,0.32048067958023013
45,atis_distance,flight,-0.0043312755137757345,0.1364146602331692
46,atis_distance,dallas,-0.0062694119849923576,0.30667496513065673
47,atis_distance,july,-0.011040996463981968,0.5040161988348846
48,atis_flight,<BIAS>,5.621774550734765,1.0
49,atis_flight,baltimore,0.39334955578075353,0.32048067958023013
50,atis_flight,dallas,0.2856697374194198,0.30667496513065673
51,atis_flight,flight,0.26537007274300256,0.1364146602331692
52,atis_flight,nineteenth,0.1845635896334971,0.7284238543344167
53,atis_flight,july,-0.10072417911224106,0.5040161988348846
54,atis_flight#atis_airfare,dallas,0.31164501267335887,0.30667496513065673
55,atis_flight#atis_airfare,flight,0.310131915912839,0.1364146602331692
56,atis_flight#atis_airfare,baltimore,0.007336351946986602,0.32048067958023013
57,atis_flight#atis_airfare,nineteenth,-0.0001824882604283625,0.7284238543344167
58,atis_flight#atis_airfare,july,-0.004165120070878445,0.5040161988348846
59,atis_flight#atis_airfare,<BIAS>,-15.786604542265605,1.0
60,atis_flight_no,flight,0.018546600243002528,0.1364146602331692
61,atis_flight_no,dallas,0.015812392161942936,0.30667496513065673
62,atis_flight_no,nineteenth,-0.0006682274529851136,0.7284238543344167
63,atis_flight_no,baltimore,-0.002820580639331898,0.32048067958023013
64,atis_flight_no,july,-0.01776452212225082,0.5040161988348846
65,atis_flight_no,<BIAS>,-0.39967668139471557,1.0
66,atis_flight_time,july,0.15110363645187377,0.5040161988348846
67,atis_flight_time,flight,0.10258495665543753,0.1364146602331692
68,atis_flight_time,dallas,0.03033593243724776,0.30667496513065673
69,atis_flight_time,nineteenth,-0.00043899800897732004,0.7284238543344167
70,atis_flight_time,baltimore,-0.14802442786108527,0.32048067958023013
71,atis_flight_time,<BIAS>,-3.144814665320342,1.0
72,atis_ground_fare,nineteenth,-0.00010216318647948287,0.7284238543344167
73,atis_ground_fare,july,-0.004532526966632925,0.5040161988348846
74,atis_ground_fare,flight,-0.005074335950955332,0.1364146602331692
75,atis_ground_fare,dallas,-0.02002569221845255,0.30667496513065673
76,atis_ground_fare,baltimore,-0.02614161689015129,0.32048067958023013
77,atis_ground_fare,<BIAS>,-2.046680905656237,1.0
78,atis_ground_service,<BIAS>,1.6272978394821676,1.0
79,atis_ground_service,nineteenth,-0.0007648374350195837,0.7284238543344167
80,atis_ground_service,july,-0.0007928757737219965,0.5040161988348846
81,atis_ground_service,baltimore,-0.04989673259560156,0.32048067958023013
82,atis_ground_service,flight,-0.11217036737985392,0.1364146602331692
83,atis_ground_service,dallas,-0.11793532221729072,0.30667496513065673
84,atis_quantity,july,0.4346875252169347,0.5040161988348846
85,atis_quantity,flight,0.31647747112363994,0.1364146602331692
86,atis_quantity,nineteenth,-0.001971688785293388,0.7284238543344167
87,atis_quantity,baltimore,-0.1335862687006469,0.32048067958023013
88,atis_quantity,dallas,-0.44942337689216155,0.30667496513065673
89,atis_quantity,<BIAS>,-3.116772609161716,1.0
