,target,feature,weight,value
0,blocker,test,-0.04851767879855138,0.7544113793190933
1,blocker,project,-0.09900406768327501,0.6564019125153913
2,blocker,<BIAS>,-3.9220062239402,1.0
3,critical,project,0.1136825357421864,0.6564019125153913
4,critical,test,-0.18147953437483644,0.7544113793190933
5,critical,<BIAS>,-4.175124173554894,1.0
6,major,<BIAS>,4.232044435231896,1.0
7,major,test,0.1349788686303527,0.7544113793190933
8,major,project,-0.3243630019906267,0.6564019125153913
9,minor,project,0.5254678664003891,0.6564019125153913
10,minor,test,0.2728117043766967,0.7544113793190933
11,minor,<BIAS>,-3.2396766541231368,1.0
12,normal,<BIAS>,9.60432205597757,1.0
13,normal,test,-0.00443657683595323,0.7544113793190933
14,normal,project,-0.2394533526642598,0.6564019125153913
15,trivial,project,0.023670020195592025,0.6564019125153913
16,trivial,test,-0.17335678299771862,0.7544113793190933
17,trivial,<BIAS>,-2.499559439590924,1.0
