{
  "appId": "com.dollarbull",
  "appName": "dollar-bull",
  "bundledWebRuntime": false,
  "npmClient": "npm",
  "webDir": "public",
  "plugins": {
    "LocalNotifications": {
      "smallIcon": "app_icon",
      "iconColor": "#488AFF",
      "sound": "beep.wav"
    },
    "SplashScreen": {
      "launchShowDuration": 0
    },
    "PushNotifications": {
      "presentationOptions": ["badge", "sound", "alert"]
    }
  },
  "cordova": {},
  "android": {
    "allowMixedContent": true
}
}
