<svg xmlns="http://www.w3.org/2000/svg" width="130" height="70" fill="none" viewBox="0 0 130 70">
    <path fill="#fff" d="M130 0H0v70h130V0z"/>
    <path fill="#1877F2" d="M31.815 42.128h-2.864v-7.139H27v-2.325h1.951v-1.653c0-1.96.863-3.366 3.719-3.366.6 0 1.552.122 1.552.122v2.158h-1c-1.015 0-1.411.309-1.411 1.162v1.577h2.373l-.211 2.325h-2.158v7.139zm6.571-9.649h-.127c-2.655 0-3.87 2-3.87 4.833 0 3.572 1.576 5 3.891 5 .561.038 1.12-.093 1.606-.378.485-.284.873-.708 1.114-1.216v1.411h2.724v-9.464H41v1.456c-.226-.5-.594-.923-1.06-1.215-.464-.292-1.005-.44-1.554-.427zm.693 2.236c1.115 0 1.785.778 1.785 2.1v1.352c.017.246-.017.493-.098.726-.082.232-.211.446-.378.627-.168.181-.37.326-.596.426-.225.1-.468.153-.715.156-1.9 0-1.847-2.049-1.847-2.732 0-2.3 1.011-2.656 1.847-2.656l.002.001zm5.749 2.683c0-1.15-.055-4.913 4.847-4.913.972-.076 1.944.142 2.79.626l-.665 2.048c-.587-.292-1.234-.447-1.89-.452-.297-.03-.598.006-.88.105-.282.099-.538.258-.752.467-.214.209-.379.462-.484.742-.105.28-.147.58-.124.877v1c-.022.3.02.602.126.884.105.282.27.538.483.75.213.213.47.377.752.481.282.104.584.146.884.123.649-.02 1.286-.176 1.872-.456l.659 2.006c-.828.5-1.796.721-2.759.63-4.668 0-4.861-3.376-4.861-4.92l.002.002zm23.607-4.917c2.656 0 3.89 2 3.89 4.833 0 3.572-1.576 5-3.891 5-.577.04-1.153-.09-1.656-.375-.504-.285-.913-.71-1.177-1.225v1.411h-2.69V27.933l2.855-.249v6.309c.253-.481.639-.88 1.112-1.148.473-.268 1.013-.394 1.556-.363l.001-.001zm-.8 2.234c-.267-.004-.531.05-.776.156-.244.108-.462.267-.64.466-.177.2-.309.434-.387.69-.078.255-.1.524-.065.788v1.352c-.018.253.018.507.105.746.086.238.222.456.399.638.176.183.389.326.624.421.236.095.488.14.742.13 1.9 0 1.847-2.049 1.847-2.732 0-2.3-1.011-2.656-1.847-2.656l-.002.001zm-10.217-2.226c-3.012 0-4.6 1.642-4.6 4.56v.542c0 3.788 2.233 4.763 4.9 4.763 1.294.08 2.587-.168 3.759-.724l-.534-1.927c-.918.365-1.894.563-2.882.586-1.56 0-2.23-.4-2.4-1.9H61.7v-1.544c0-3.166-1.785-4.358-4.28-4.358l-.002.002zm.073 1.93c1.043 0 1.718.639 1.681 2.122h-3.515c.061-1.561.789-2.122 1.834-2.122zm20.527-1.943c-3.093 0-4.718 1.743-4.718 4.869 0 4.286 2.807 4.975 4.726 4.975 2.81 0 4.68-1.513 4.68-4.937 0-3.563-2.1-4.905-4.685-4.905l-.003-.002zm-.039 2.246c1.36 0 1.9 1.018 1.9 2.176v1c0 1.4-.754 2.215-1.9 2.215-1.076 0-1.831-.759-1.831-2.215v-1c0-1.553.9-2.176 1.837-2.176h-.006zm10.413-2.246c-3.093 0-4.721 1.743-4.721 4.867 0 4.286 2.807 4.975 4.726 4.975 2.81 0 4.68-1.513 4.68-4.937 0-3.563-2.1-4.905-4.685-4.905zm-.039 2.246c1.36 0 1.9 1.018 1.9 2.176v1c0 1.4-.754 2.215-1.9 2.215-1.076 0-1.831-.759-1.831-2.215v-1c0-1.553.9-2.176 1.837-2.176h-.006zm5.8 7.405V27.933l2.867-.249v9.514l2.841-4.534h3.024l-2.964 4.7L103 42.128h-3.033l-2.947-4.63v4.629h-2.867z"/>
</svg>
