<svg xmlns="http://www.w3.org/2000/svg" width="40" height="40" fill="none" viewBox="0 0 40 40">
    <path fill="#fff" d="M0 0H40V40H0z"/>
    <path fill="#196BE5" d="M19 21V7.875h-.938C10.309 7.875 4 14.183 4 21.938 4 29.691 10.308 36 18.063 36c7.754 0 14.062-6.308 14.062-14.063V21H19z"/>
    <path fill="#FFB900" d="M21.938 4H21v15h15v-.938C36 10.309 29.692 4 21.937 4z"/>
</svg>
