{
  "employees": [
    {
      "id" : 5,
      "name": "Michael Stone",
      "office": "321b",
      "email" : "michael.stone@oscorp.com",
      "phone" : "415.331.3321",
      "role" : "Teir 3 Support Engineer"
    },
    {
      "id" : 8,
      "name": "Amber Johnson",
      "office": "332c",
      "email" : "amber.johnson@oscorp.com",
      "phone" : "415.337.4345",
      "role" : "Senior Project Manager"
    },
    {
      "id" : 11,
      "name": "Jung Wei-Li",
      "office": "305a",
      "email" : "jung.wei-li@oscorp.com",
      "phone" : "415.221.8810",
      "role" : "SEO Analyst"
    },
    {
      "id" : 15,
      "name": "Cliff Rosen",
      "office": "361d",
      "email" : "clifford.rosen@oscorp.com",
      "phone" : "415.654.6010",
      "role" : "Operations Analyst"
    },
    {
      "id" : 16,
      "name": "Maria Velasquez",
      "office": "345d",
      "email" : "maria.velasquez@oscorp.com",
      "phone" : "415.541.9819",
      "role" : "Senior Data Scientist"
    },
    {
      "id" : 22,
      "name": "Carol Dawson",
      "office": "312A",
      "email" : "carol.dawson@oscorp.com",
      "phone" : "415.212.0045",
      "role" : "Software Development Engineer II"
    }
  ]
}