.................
----------------------------------------------------------------------
Ran 17 tests in 0.627s

OK
Name             Stmts   Miss Branch BrPart  Cover   Missing
------------------------------------------------------------
Collatz.py          49      0     14      0   100%
TestCollatz.py      70      0      0      0   100%
------------------------------------------------------------
TOTAL              119      0     14      0   100%
