1 10 20
100 200 125
201 210 89
900 1000 174
1 999999 525
10 1 20
100 100 26
1 100 119
101 250 128
251 500 144
501 750 171
751 1000 179
1001 1500 182
1501 2000 180
2001 3000 217
3001 4000 238
4001 5000 215
5001 6000 236
6001 7000 262
7001 8000 252
8001 9000 247
9001 10000 260
10001 15000 276
15001 20000 279
20001 25000 282
25001 30000 308
30001 35000 311
35001 40000 324
40001 45000 288
45001 50000 314
50001 60000 340
60001 70000 335
70001 80000 351
80001 90000 333
90001 100000 333
100001 102500 341
102501 108500 354
108501 114500 323
114501 120500 349
120501 126500 336
126501 132500 344
132501 138500 344
138501 144500 375
144501 150500 370
150501 156500 383
156501 162500 370
162501 168500 352
168501 174500 347
174501 180500 365
180501 186500 334
186501 192500 360
192501 198500 360
198501 204500 342
204501 210500 373
210501 216500 386
216501 222500 355
222501 228500 368
228501 234500 443
234501 240500 350
240501 246500 368
246501 252500 350
252501 258500 363
258501 264500 407
264501 270500 407
270501 276500 363
276501 282500 389
282501 288500 389
288501 294500 389
294501 300500 371
300501 306500 340
306501 312500 384
312501 318500 353
318501 324500 371
324501 330500 384
330501 336500 366
336501 342500 366
342501 348500 441
348501 354500 379
354501 360500 410
360501 366500 366
366501 372500 392
372501 378500 423
378501 384500 379
384501 390500 436
390501 396500 405
396501 402500 387
402501 408500 405
408501 414500 449
414501 420500 387
420501 426500 418
426501 432500 374
432501 438500 387
438501 444500 400
444501 450500 369
450501 456500 387
456501 462500 444
462501 468500 413
468501 474500 382
474501 480500 413
480501 486500 382
486501 492500 382
492501 498500 426
498501 504500 426
504501 510500 382
510501 516500 470
516501 522500 439
522501 528500 408
528501 534500 377
534501 540500 377
540501 546500 408
546501 552500 452
552501 558500 421
558501 564500 359
564501 570500 421
570501 576500 372
576501 582500 390
582501 588500 434
588501 594500 403
594501 600500 372
600501 606500 403
606501 612500 403
612501 618500 447
618501 624500 372
624501 630500 509
630501 636500 416
636501 642500 416
642501 648500 354
648501 654500 385
654501 660500 429
660501 666500 442
666501 672500 367
672501 678500 385
678501 684500 380
684501 690500 398
690501 696500 442
696501 702500 411
702501 708500 504
708501 714500 411
714501 720500 380
720501 726500 411
726501 732500 380
732501 738500 424
738501 744500 424
744501 750500 393
750501 756500 424
756501 762500 380
762501 768500 468
768501 774500 393
774501 780500 437
780501 786500 375
786501 792500 406
792501 798500 468
798501 804500 406
804501 810500 406
810501 816500 406
816501 822500 450
822501 828500 419
828501 834500 419
834501 840500 525
840501 846500 401
846501 852500 419
852501 858500 419
858501 864500 370
864501 870500 388
870501 876500 432
876501 882500 401
882501 888500 445
888501 894500 370
894501 900500 370
900501 906500 445
906501 912500 476
912501 918500 401
918501 924500 445
924501 930500 476
930501 936500 414
936501 942500 507
942501 948500 383
948501 954500 414
954501 960500 383
960501 966500 414
966501 972500 458
972501 978500 383
978501 984500 427
984501 990500 427
990501 996500 365
996501 999999 440
